�s���{���R�[�h���͎s�撬���R�[�h,NO,�s���{����,�s�撬����,�C�x���g��,�C�x���g��_�J�i,�C�x���g��_�p��,�J�n��,�I����,�J�n����,�I������,�J�n�������L����,����,����(��{),����(�ڍ�),�A���於��,�A����d�b�ԍ�,�A��������ԍ�,��Î�,�ꏊ����,�Z��,����,�ܓx,�o�x,�A�N�Z�X���@,���ԏ���,���,�Q���\���I����,�Q���\���I������,�Q���\�����@,URL,���l
131199,,�����s,����,�n��f�r���[�Z�~�i�[�i�h�Еҁj,�`�C�L�f�r���[�Z�~�i�[�i�{�E�T�C�w���j,,2021/3/10,2021/3/10,14�F00,16:00,,"�n�抈���ɂ��ċ����̂�����E�͂��߂Ă݂����ƍl���Ă������ΏۂƂ����u���ł��B����́A�C�ۍЊQ���y�����邽�߁i���ɖ�����邽�߁j�C�ۏ��̊��p���@��m�邱�Ƃ�A�ЊQ���N�������Ƃ��ɗ����オ��ЊQ�{�����e�B�A�Z���^�[�ɂ��Ēm�邱�ƂŁA�n��ł̖h�ЁE���Ђ��w��ł����܂��B	�C�ۏ��̊��p�ɂ��ā@�u�t�F�����ǋ�C�ۑ�E��	�ЊQ�{�����e�B�A�ɂ��ā@�u�t�F�����΂������{�����e�B�A�Z���^�[�E��",,,,,,,������ُ��z�[��,,,,,,,,,,,/1000779/1000799/1000800/1031284.html,
131199,,�����s,����,�����u��,�\�c�j���E�R�E�U,,2021/3/5,2021/3/5,9:30,10:30,,"	�@1��6�����܂ł̂��q������q��Ē��ŁA�������n�߂悤�Ƃ��Ă������A�������n�߂�����ǂȂ��Ȃ���肭�����Ȃ�����Ώۂɏ��Y�t��Ǘ��h�{�m�A���ȉq���m���u�`�������Ȃ��܂�	�@���q����ƈꏏ�Ɏ�u���Ă��������܂��i���q����̈ꎞ�a����͂������܂���j	�@�u�`���Ԃ͈ꎞ�Ԓ��x�ł�",,,,,,,,,,,,,,,2021/3/4,,,/1000779/1000809/1000817/1030932.html,
131199,,�����s,����,�����u��,�\�c�j���E�R�E�U,,2021/3/5,2021/3/5,10:15,11:15,,"	�@1��6�����܂ł̂��q������q��Ē��ŁA�������n�߂悤�Ƃ��Ă������A�������n�߂�����ǂȂ��Ȃ���肭�����Ȃ�����Ώۂɏ��Y�t��Ǘ��h�{�m�A���ȉq���m���u�`�������Ȃ��܂�	�@���q����ƈꏏ�Ɏ�u���Ă��������܂��i���q����̈ꎞ�a����͂������܂���j	�@�u�`���Ԃ͈ꎞ�Ԓ��x�ł�",,,,,,,,,,,,,,,2021/3/4,,,/1000779/1000809/1000817/1030932.html,
131199,,�����s,����,�����u��,�\�c�j���E�R�E�U,,2021/3/5,2021/3/5,11:00,12:00,,"	�@1��6�����܂ł̂��q������q��Ē��ŁA�������n�߂悤�Ƃ��Ă������A�������n�߂�����ǂȂ��Ȃ���肭�����Ȃ�����Ώۂɏ��Y�t��Ǘ��h�{�m�A���ȉq���m���u�`�������Ȃ��܂�	�@���q����ƈꏏ�Ɏ�u���Ă��������܂��i���q����̈ꎞ�a����͂������܂���j	�@�u�`���Ԃ͈ꎞ�Ԓ��x�ł�",,,,,,,,,,,,,,,2021/3/4,,,/1000779/1000809/1000817/1030932.html,
131199,,�����s,����,�ߘa2�N�x�@�������Ƃƈ玙���l����u���@�Q���ҕ�W,���C���j�l���h�@�n�^���N�R�g�g�C�N�W���J���K�G���R�E�U�@�T���J�V���{�V���E,,2021/2/26,2021/2/26,10:00,12:00,,��1��w���Ƃ̕t���������x�Ɓw�R���i�ɑ΂���󂯎~�ߕ��̈Ⴂ�x�F�X�g���X�̌��������Ă݂悤��2��w�������x�������Ȃ���q��Ă���ɂ́F�w�������x�w���l���x���ӎ����A�C�����ɂ�Ƃ�����낤&nbsp;����4�����ȏ�̖��A�w���̕ۈ炠��i���8�l�A�\�����j,,,,,,,�܂Ȃہ[�Ƒ匴,,,,,,,,2021/2/19,,,/1000779/1000922/1000927/1030901.html,
131199,,�����s,����,�ߘa2�N�x�@�������Ƃƈ玙���l����u���@�Q���ҕ�W,���C���j�l���h�@�n�^���N�R�g�g�C�N�W���J���K�G���R�E�U�@�T���J�V���{�V���E,,2021/3/5,2021/3/5,10:00,12:00,,��1��w���Ƃ̕t���������x�Ɓw�R���i�ɑ΂���󂯎~�ߕ��̈Ⴂ�x�F�X�g���X�̌��������Ă݂悤��2��w�������x�������Ȃ���q��Ă���ɂ́F�w�������x�w���l���x���ӎ����A�C�����ɂ�Ƃ�����낤&nbsp;����4�����ȏ�̖��A�w���̕ۈ炠��i���8�l�A�\�����j,,,,,,,�܂Ȃہ[�Ƒ匴,,,,,,,,2021/2/19,,,/1000779/1000922/1000927/1030901.html,
131199,,�����s,����,�q�D���r����邨����,�X�L���J�^���I�`���J�C,,2020/11/14,2020/11/14,15:00,17:00,,�Ȃ�ƂȂ��F�B�ɘb���Â炢���ƁA�e�ɂ͌����Ȃ����ƁA������ƋC�ɂȂ邾���̂��Ɓc�c������ׂ肵�Ă݂܂��񂩁H����̃e�[�}�́u�D���Ȑl�v�q�D���r����邨����́A���S���āu�D���v�������ł��B���Ȃ��́u�D���v�ɂ��Č���Ă݂܂��񂩁H�����Ă��邾���ł�OK�I���Ђ��Q�����������B,,,,,,,�܂Ȃہ[�Ɛ����@i-youth�J�t�F,,,,,,,,2020/11/14,,,/1000779/1000922/1000927/1027910.html,
131199,,�����s,����,�y���~�z�����΂��{�����e�B�A�E�s�������t�H�[����,�y�`���E�V�z�C�^�o�V�{�����e�B�A�E�V�~���J�c�h�E�t�H�[����,,2020/4/18,2020/4/18,17:30,19:30,4��18���i�y�j���j�ߌ�5��30������7��30���E4��19���i���j���j�ߑO9������10��,�n��ɕ�炷�l�X�ȋ���A�����I�w�i�A���x�̈Ⴂ�������āA���݂ɗ������������Ƃ��瑽���������Љ�̎����ւ̑������n�܂�B�����ŁA�g�߂Ȓn��ɏZ�ރA�t���J�̗��w���Ƃ̌𗬂ɂ��A�u�ǂ��E�܂ȂԁE�ނ��сv���n�߂݂܂��񂩁B���F�܂Ȃہ[�Ƒ匴�i�匴���U�w�K�Z���^�[�j���N���[�V�����z�[���u�t�F�鋞��w��w�@���O�q���w�����ȋ��� �R�{�G��SDGs�l�b�g���[�N�����΂���\ �����ד����c���@�l�{�����e�B�A�E�s�������w�K���i�Z���^�[������ �A���J�Y�q�ΏہF�ǂȂ��ł�����F60��,,,,,,,,,,,,,,,,,,/1000779/1000922/1000927/1021892.html,
131199,,�����s,����,�y���~�z�����΂��{�����e�B�A�E�s�������t�H�[����,�y�`���E�V�z�C�^�o�V�{�����e�B�A�E�V�~���J�c�h�E�t�H�[����,,2020/4/19,2020/4/19,9:00,10:00,4��18���i�y�j���j�ߌ�5��30������7��30���E4��19���i���j���j�ߑO9������10��,�n��ɕ�炷�l�X�ȋ���A�����I�w�i�A���x�̈Ⴂ�������āA���݂ɗ������������Ƃ��瑽���������Љ�̎����ւ̑������n�܂�B�����ŁA�g�߂Ȓn��ɏZ�ރA�t���J�̗��w���Ƃ̌𗬂ɂ��A�u�ǂ��E�܂ȂԁE�ނ��сv���n�߂݂܂��񂩁B���F�܂Ȃہ[�Ƒ匴�i�匴���U�w�K�Z���^�[�j���N���[�V�����z�[���u�t�F�鋞��w��w�@���O�q���w�����ȋ��� �R�{�G��SDGs�l�b�g���[�N�����΂���\ �����ד����c���@�l�{�����e�B�A�E�s�������w�K���i�Z���^�[������ �A���J�Y�q�ΏہF�ǂȂ��ł�����F60��,,,,,,,,,,,,,,,,,,/1000779/1000922/1000927/1021892.html,
131199,,�����s,����,�u�����I�Ȋw�K�̎��ԁv�Ɋւ��Ⴊ���҂̎Љ�Q�����l����,�u�\�E�S�E�e�L�i�K�N�V���E�m�W�J���v�j�J�J�����V���E�K�C�V���̃V���J�C�T���J���J���K�G��,,2020/7/5,2020/7/5,13:30,16:00,,"	��u���@�Љ����w�Z�ȂǂɌq����Ӌ`�ɂ���	���ᔭ�\�@�u�����I�Ȋw�K�̎��ԁv�ɎQ���������̊w��	�ӌ�����	���@�]	�@( �u�t �n����w���_���� �ؑS �͕v �� �j",,,,,,,�匴���U�w�K�Z���^�[�@3�K�@�܂Ȃہ[�ƃz�[��,,,,,,,,,,,/1000779/1000922/1000927/1023253.html,
131199,,�����s,����,�u����u���̂����x����A������̉��}���u�v,�R�E�G���J�C�u�C�m�`���T�T�G���A�R�R���m�I�E�L���E�V���`�v,,2021/3/11,2021/3/11,10:00,11:30,,������̉��}���u�ɂ��Ă̍u�`�ƃ��[���v���C�V�^�R���i�E�C���X�����ǂ̉e���ɂ����e���ꕔ�ύX����ꍇ���������܂��B���炩���߂��������������܂��悤���肢�\���グ�܂��B,,,,,,,�O���[���z�[��2�K�z�[��,,,,,,,,,,,/kenko/soudan/kokoro/1031034.html,
131199,,�����s,����,�u����u���̂����x����A������̉��}���u�v,�R�E�G���J�C�u�C�m�`���T�T�G���A�R�R���m�I�E�L���E�V���`�v,,2021/3/12,2021/3/12,10:00,11:30,,������̉��}���u�ɂ��Ă̍u�`�ƃ��[���v���C�V�^�R���i�E�C���X�����ǂ̉e���ɂ����e���ꕔ�ύX����ꍇ���������܂��B���炩���߂��������������܂��悤���肢�\���グ�܂��B,,,,,,,�O���[���z�[��2�K�z�[��,,,,,,,,,,,/kenko/soudan/kokoro/1031034.html,
131199,,�����s,����,�u����u�R���i�Ђɂ����ĕs�o�Z�E�Ђ�������Ƃǂ������������v,�R�E�G���J�C�u�R���i�J�j�I�C�e�t�g�E�R�E�E�q�L�R�����g�h�E���L�A�E�J�v,,2021/3/8,2021/3/8,10:00,12:00,,�u�`�i�R���i�Ђɂ�����s�o�Z�E�Ђ�������̕��̗�����e���A�󋵕ʂ̃R�~���j�P�[�V�����A���k��̏��񋟂Ȃǁj�Ǝ��^����,,,,,,,�O���[���z�[��601��c��,,,,,,,,,,,/kenko/soudan/kokoro/1031031.html,
131199,,�����s,����,�ߘa2�N�x��4�񌤏C��᎖�Ə����m���Ă����ׂ��ߗ׏Z���Ƃ̌��Q���ɂ��ā�,���C���j�l���h�_�C�����J�C�P���V���E�J�C��W�M���E�V���K�V�b�e�I�N�x�L�L�������W���E�~���g�m�R�E�K�C�����_�C�j�c�C�e��,,2021/3/5,2021/3/5,15:00,17:00,,���Ə����H��Ȃǂ𑀋Ƃ���ɂ�����A�ߗ׏Z���Ƃ̑�����U���A�L�C�Ƃ�����������������i������j���߂ɁA�ߋ��̎��Ⴉ��΍�Ɖ������@�ɂ��ĉ�����܂��B,,,,,,,���Y�A��ف@3�K��c���i���h54-10�j,,,,,,,,2021/2/26,,,/bousai/kankyo/ondanka/kenshu/1031039.html,
131199,,�����s,����,�ߘa2�N�x��3�񌤏C���ȃG�l���M�[�΍�Z�~�i�[��ቻ�w�����ɑ΂���J���ЊQ�h�~�΍�݂̍����,���C���j�l���h�_�C�T���J�C�P���V���E�J�C��V���E�G�l���M�[�^�C�T�N�Z�~�i�[���J�K�N�u�b�V�c�j�^�C�X�����E�h�E�T�C�K�C�{�E�V�^�C�T�N�̃A���J�^��,,2021/1/26,2021/1/26,15:00,17:00,,��1���u�ȃG�l���M�[�΍�Z�~�i�[�v�ē~�Ɏg�p�ʂ�������󒲂�A�V�^�R���i�E�C���X�����Ǘ\�h�Ƃ��Ă̊��C�ɂ��ĂȂǁA�ȃG�l���M�[�΍�����Ƃɉ�����܂���2���u���w�����ɑ΂���J���ЊQ�h�~�΍�݂̍���v���w�����ɂ�����J���҂̌��N��Q�h�~�̕K�v���Ȃǂɂ��ĉ�����܂�,,,,,,,���Y�A��ف@3�K��c���i���h54-10�j,,,,,,,,2021/1/20,,,/bousai/kankyo/ondanka/kenshu/1029228.html,
131199,,�����s,����,�ߘa2�N�x��2�񌤏C��ᒆ����Ƃ�SDGs�Ή��Z�~�i�[��,���C���j�l���h�_�C�j�J�C�P���V���E�J�C��`���E�V���E�L�M���E�m�G�X�f�B�[�W�[�Y�^�C�I�E�Z�~�i�[��,,2020/12/10,2020/12/10,15:00,17:00,,SDGs�Ƃ͉����A���̍�SDGs���K�v�Ƃ���邩����{�������������܂��B�܂�������ƂȂǂ�SDGs�̎�g����g�ރ����b�g�Ȃǂ��͂��߁A�ǂ̂悤�ɑΉ����Ă����΂悢��������������܂��B,,,,,,,���Y�A��ف@3�K��c���i���h54-10�j,,,,,,,,,,,/bousai/kankyo/ondanka/kenshu/1028313.html,
131199,,�����s,����,�ߘa2�N�x��1�񌤏C��ᒆ����Ƃ�BCP�΍�Z�~�i�[��,���C���j�l���h�_�C�C�b�J�C�P���V���E�J�C��`���E�V���E�L�M���E�m�r�[�V�[�s�[�^�C�T�N�Z�~�i�[��,,2020/9/29,2020/9/29,15:00,17:00,,�l�X�Ȏ��R�ЊQ��ً}���̎��ƌp���ɂ��Ăǂ̂悤�ȑ΍���u���Ă����K�v������̂��ABCP�̊�b���������܂��B�܂��A����̐V�^�R���i�E�C���X�����ǂȂǂɑΉ�����BCP����̃|�C���g�ɂ��Ă�������܂��B,,,,,,,���Y�A��ف@3�K��c���i���h54-10�j,,,,,,,,2020/9/25,,,/bousai/kankyo/ondanka/kenshu/1026714.html,
131199,,�����s,����,�ߘa���N�x�i����31�N�x�j��5�񌤏C��ᒆ����Ƃ��s���ׂ��C��ϓ��ւ́w�K���x��,���C���K���l���h�i�w�C�Z�C�T���W���E�C�`�l���j�_�C�S�J�C�P���V���E�J�C��`���E�V���E�L�M���E�K�I�R�i�E�x�L�L�R�E�w���h�E�w�m�w�e�L�I�E�x��,,2020/3/18,2020/3/18,14:00,16:00,,�ߔN�A�ҏ���䕗�⍋�J�Ȃǂ̋C��ϓ��̉e�������������A�C��ϓ��̉e���ɂ���Q��h�~�A�y���������c�邽�߂ɂ͋C��ϓ��ɓK�����邱�Ƃ����߂��Ă��܂��B�����Œ�����Ƃ��ǂ̂悤�ɋC��ϓ��ɓK�����Ă����ׂ����ɂ��Ă��Љ�܂��B,,,,,,,���Y�A��ف@3�K��c���i���h54-10�j,,,,,,,,,,,/bousai/kankyo/ondanka/kenshu/1016157.html,
131199,,�����s,����,�u�����ڂ���v���~�̂��m�点,�u�A�\�{�E�J�C�v�`���E�V�m�I�V���Z,,2020/10/14,2020/10/14,,,�V�^�R���i�E�C���X�����h�~�g��h�~�̂��߁A�ߘa2�N�x�́u�����ڂ���v�͒��~�Ƃ����Ē����܂����B�\���󂲂����܂���B������Ȃǂ������܂�����A�d�b�ɂĂ��₢���킹���������B,,,,,,,,,,,,,,,,,,,/kosodate/azukeru/ninka/annai/hoikuen/itabashi/1015549/1024010.html,
131199,,�����s,����,�u�����ڂ���v���~�̂��m�点,�u�A�\�{�E�J�C�v�`���E�V�m�I�V���Z,,2020/11/10,2020/11/10,,,�V�^�R���i�E�C���X�����h�~�g��h�~�̂��߁A�ߘa2�N�x�́u�����ڂ���v�͒��~�Ƃ����Ē����܂����B�\���󂲂����܂���B������Ȃǂ������܂�����A�d�b�ɂĂ��₢���킹���������B,,,,,,,,,,,,,,,,,,,/kosodate/azukeru/ninka/annai/hoikuen/itabashi/1015549/1024010.html,
131199,,�����s,����,�u�����ڂ���v���~�̂��m�点,�u�A�\�{�E�J�C�v�`���E�V�m�I�V���Z,,2020/12/9,2020/12/9,,,�V�^�R���i�E�C���X�����h�~�g��h�~�̂��߁A�ߘa2�N�x�́u�����ڂ���v�͒��~�Ƃ����Ē����܂����B�\���󂲂����܂���B������Ȃǂ������܂�����A�d�b�ɂĂ��₢���킹���������B,,,,,,,,,,,,,,,,,,,/kosodate/azukeru/ninka/annai/hoikuen/itabashi/1015549/1024010.html,
131199,,�����s,����,�u�����ڂ���v���~�̂��m�点,�u�A�\�{�E�J�C�v�`���E�V�m�I�V���Z,,2021/1/20,2021/1/20,,,�V�^�R���i�E�C���X�����h�~�g��h�~�̂��߁A�ߘa2�N�x�́u�����ڂ���v�͒��~�Ƃ����Ē����܂����B�\���󂲂����܂���B������Ȃǂ������܂�����A�d�b�ɂĂ��₢���킹���������B,,,,,,,,,,,,,,,,,,,/kosodate/azukeru/ninka/annai/hoikuen/itabashi/1015549/1024010.html,
