�s���{���R�[�h���͎s�撬���R�[�h,NO,�s���{����,�s�撬����,�C�x���g��,�C�x���g��_�J�i,�C�x���g��_�p��,�J�n��,�I����,�J�n����,�I������,�J�n�������L����,����,����(��{),����(�ڍ�),�A���於��,�A����d�b�ԍ�,�A��������ԍ�,��Î�,�ꏊ����,�Z��,����,�ܓx,�o�x,�A�N�Z�X���@,���ԏ���,���,�Q���\���I����,�Q���\���I������,�Q���\�����@,URL,���l
131199,,�����s,����,�u�����}�C�E�^�C�����C���v�u�K,�u�g�E�L���E�}�C�E�^�C�����C���v�R�E�V���E,,2021/7/17,2021/7/17,9:30,11:30,,�}�C�E�^�C�����C���V�[�g�̍쐬���@��A���ɕK�v�ȏ��ɂ��ĉ�����܂��B��u�҂ɂ͉��Łu�����E�}�C�^�C�����C���v�ƃn�U�[�h�}�b�v��z�z���܂��B,,,,,,,��������{���� ���4�K �ЊQ�΍�,,,,,,,,2021/6/21,,,/1000779/1000796/1000798/1033243.html,
131199,,�����s,����,�u�����}�C�E�^�C�����C���v�u�K,�u�g�E�L���E�}�C�E�^�C�����C���v�R�E�V���E,,2021/7/18,2021/7/18,9:30,11:30,,�}�C�E�^�C�����C���V�[�g�̍쐬���@��A���ɕK�v�ȏ��ɂ��ĉ�����܂��B��u�҂ɂ͉��Łu�����E�}�C�^�C�����C���v�ƃn�U�[�h�}�b�v��z�z���܂��B,,,,,,,�@���n��Z���^�[���N���G�[�V�����z�[��,,,,,,,,2021/6/21,,,/1000779/1000796/1000798/1033243.html,
131199,,�����s,����,�O��X�|�[�c���in���������X�^���v�����[,�}�G�m�X�|�[�c�^�C�J�Cin�A���P�A���P�X�^���v�����[,,2022/10/9,2022/10/9,8:30,12:00,,�O���6�����̃`�F�b�N�|�C���g���܂��A�X�^���v���W�߂悤�I4�ȏソ�܂�΃S�[���ł����������ł����B�͂���Ă��S���ɎQ���܂������B�݂�ȂőO�쒬��������I�i���O�\�����Ȃ̂ŕK���O��n��Z���^�[�ɐ\������ł��������B�j,,,,,,,�O�쒬�S��,,,,,,,,2022/9/30,,,/1000779/1000799/1000800/1040839.html,
131199,,�����s,����,�����S�������n���Ռ����y�c�R���T�[�g,�����S���R�N���c�o�g�E�L���R�E�L���E�K�N�_���R���T�[�g,,2022/12/20,2022/12/20,18:00,20:00,,�搭�{�s90���N�A���{�E�����S���O���֌W����50���N�A�܂�2021�N�̔���ƃ����S�����u�����E����𗬋���F����25���N���L�O���āA�n��30���N���}���郂���S�������n���Ռ����y�c�ɂ����{�������J�Â��܂��B&nbsp;&nbsp;,,,,,,,���旧������ّ�z�[���i�����R����51-1�j,,,,,,,,,,,/1000779/1000799/1000802/1041500.html,
131199,,�����s,����,������u���@�H�i���X�팸�̃R�c,�V���E�q�Z�C�J�c�R�E�U�@�V���N�q�����X�T�N�Q���m�R�c,,2022/12/1,2022/12/1,10:00,11:40,,�u�`�u���X�̐H�����łł���H�i���X�팸�̃R�c�v�u����̃t�[�h�h���C�u���g�݁v���������w�������H�i�̈ꕔ�𖳑ʂɂ��āA�̂ĂĂ��܂��H�i���X�B���X�̐H�����̒��ŁA������Ƃ����C������K���ŁA�H�i���X�����炷���Ƃ��ł��܂��B�H��̖��ʌ�����h���ƌv�ɂ��D�����A���݂����炵�Ċ��ɂ��z���ł��܂��B�H�i���X�����炷�R�c���w��ŁA�ł��邱�Ƃ���n�߂Ă݂܂��傤�B&nbsp;,,,,,,,���旧�O���[���z�[��2�K�z�[���i����h��36-1�j,,,,,,,,,,,/1000779/1000805/1000807/1041650.html,
131199,,�����s,����,�p�l���W�u�s���Ă݂悤�I���Ă݂悤�I�����΂��v,�p�l���e���u�C�b�e�~���E�I�~�e�~���E�I�C�^�o�V�v,,2022/11/12,2022/11/12,,,,,,,,,,,�Ԓˎx��1�K�M�������[,,,,,,,,,,,/1000779/1000805/1000807/1041932.html,
131199,,�����s,����,�p�l���W�u�s���Ă݂悤�I���Ă݂悤�I�����΂��v,�p�l���e���u�C�b�e�~���E�I�~�e�~���E�I�C�^�o�V�v,,2022/11/13,2022/11/13,,,,,,,,,,,�Ԓˎx��1�K�M�������[,,,,,,,,,,,/1000779/1000805/1000807/1041932.html,
131199,,�����s,����,�V�j�A�������߂ẴX�}�[�g�t�H�����S�����iAndroid�EiPhone�j,�V�j�A���P�n�W���e�m�X�}�[�g�t�H���A���[���L���E�V�c�iAndroid�EiPhone�j,,2022/12/15,2022/12/15,10:00,12:00,,��{�I�ȑ���E�s�������̑Ώ����@�Ȃ�,,,,,,,�������҃Z���^�[�i�����2-65-6�@��񏈗��Z���^�[7�K�j,,,,,,,,,,,/1000779/1000805/1000807/1041733.html,
131199,,�����s,����,�����t���w��@�斯���J�u��,�C�^�o�V�N�C�V�J�C�C�K�N�J�C�@�N�~���R�E�J�C�R�E�U,,2022/12/4,2022/12/4,13:30,15:00,,���e�E�u�t�u���u�a�@�E�f�Ï��̖����̈Ⴂ�ƒn���ØA�g�ɂ��āv�����t�� ���� ���������ʍu���u�t���C���E�F�m�Ǘ\�h 100�Ύ���F�l���̌㔼���ǂ������������v�u�t�F�����s���N������ÃZ���^�[ ������ ���H����A���� �����t�� � �V���p��,,,,,,,���旧������ف@��z�[��,,,,,,,,2022/11/22,,,/1000779/1000809/1000814/1041191.html,
131199,,�����s,����,�V�N�w�E�V�N��w���J�u��,���E�l���K�N�E���E�l���C�K�N�R�E�J�C�R�E�U,,2023/1/24,2023/1/24,13:15,16:00,,���e�E�u�t1�D�u�����ǐf�Âɂ�����������̐i���ƍŐ�[ �݃J�����{�����g�Ō�������́v�i�n�Ɓj�����s���N������ÃZ���^�[ ��������� ���� ���� �q�k2�D�u�X���Ƃǂ��������H�v���Z���^�[ �O�ȑ������� ���� �O��3�D�u�X�������̍őO�� �\����Ɩo�łւ̓������\�v���Z���^�[������ �V�N�a���w�����`�[�� �������� �Γn �r�s,,,,,,,���旧������ف@��z�[��,,,,,,,,,,,/1000779/1000809/1000814/1042317.html,
131199,,�����s,����,�����H����c���H�ւ̂����ߕ��i������N�����Z���^�[�j�ߑO�̕�,���j���E�V���N�J�����E�W�V���N�w�m�X�X���J�^�i�J�~�C�^�o�V�P���R�E�t�N�V�Z���^�[�j�S�[���m�u,,2022/11/22,2022/11/22,10:00,10:45,,"9��������1��6�����̂��q����̕ی�҂̕���ΏۂɁA�����H�㔼����c���H�ւ̂����ߕ��ɂ��āA�u�`�Ɨ����Љ�E�W���̍u�K����J�Â��܂��B&nbsp;	����������痣������������̐H�ނ̌`�ԁA�傫���A�����Ȃ�	��l�̐H�������蕪���č�闣���H	��Â��ݐH��",,,,,,,������N�����Z���^�[,,,,,,,,,,,/1000779/1000809/1000818/1036310.html,
131199,,�����s,����,�����H����c���H�ւ̂����ߕ��i������N�����Z���^�[�j�ߌ�̕�,���j���E�V���N�J�����E�W�V���N�w�m�X�X���J�^�i�J�~�C�^�o�V�P���R�E�t�N�V�Z���^�[�j�S�S�m�u,,2022/11/22,2022/11/22,14:00,14:45,,"9��������1��6�����̂��q����̕ی�҂̕���ΏۂɁA�����H�㔼����c���H�ւ̂����ߕ��ɂ��āA�u�`�Ɨ����Љ�E�W���̍u�K����J�Â��܂��B&nbsp;	����������痣������������̐H�ނ̌`�ԁA�傫���A�����Ȃ�	��l�̐H�������蕪���č�闣���H	��Â��ݐH��",,,,,,,������N�����Z���^�[,,,,,,,,,,,/1000779/1000809/1000818/1036310.html,
131199,,�����s,����,�����H����c���H�ւ̂����ߕ��i�Ԓˌ��N�����Z���^�[�j�ߑO�̕�,���j���E�V���N�J�����E�W�V���N�w�m�X�X���J�^�i�A�J�c�J�P���R�E�t�N�V�Z���^�[�j�S�[���m�u,,2022/12/9,2022/12/9,10:00,10:45,,"9��������1��6�����̂��q����̕ی�҂̕���ΏۂɁA�����H�㔼����c���H�ւ̂����ߕ��ɂ��āA�u�`�Ɨ����Љ�E�W���̍u�K����J�Â��܂��B	����������痣������������̐H�ނ̌`�ԁA�傫���A�����Ȃ�	��l�̐H�������蕪���č�闣���H	��Â��ݐH��",,,,,,,�Ԓˌ��N�����Z���^�[,,,,,,,,,,,/1000779/1000809/1000819/1040686.html,
131199,,�����s,����,�����H����c���H�ւ̂����ߕ��i�Ԓˌ��N�����Z���^�[�j�ߌ�̕�,���j���E�V���N�J�����E�W�V���N�w�m�X�X���J�^�i�A�J�c�J�P���R�E�t�N�V�Z���^�[�j�S�S�m�u,,2022/12/9,2022/12/9,14:00,14:45,,"9��������1��6�����̂��q����̕ی�҂̕���ΏۂɁA�����H�㔼����c���H�ւ̂����ߕ��ɂ��āA�u�`�Ɨ����Љ�E�W���̍u�K����J�Â��܂��B	����������痣������������̐H�ނ̌`�ԁA�傫���A�����Ȃ�	��l�̐H�������蕪���č�闣���H	��Â��ݐH��",,,,,,,�Ԓˌ��N�����Z���^�[,,,,,,,,,,,/1000779/1000809/1000819/1040686.html,
131199,,�����s,����,�����H����c���H�ւ̂����ߕ��i�u�����N�����Z���^�[�j�ߑO�̕�,���j���E�V���N�J�����E�W�V���N�w�m�X�X���J�^�i�V�����P���R�E�t�N�V�Z���^�[�j�S�[���m�u,,2022/12/20,2022/12/20,10:00,10:45,,"9��������1��6�����̂��q����̕ی�҂̕��ɁA�����H�㔼����c���H�ւ̂����ߕ��ɂ��āA�u�`�Ɨ����Љ�A�����W���̍u�K����J�Â��܂��B	9�������痣������������̐H�ނ̌`�ԁA�傫���A�����Ȃ�	��l�ƈꏏ�ɐH�ׂ闣���H	��Â��ݐH��",,,,,,,�u�����N�����Z���^�[�i�@��2-5-5�j,,,,,,,,,,,/1000779/1000809/1000820/1040496.html,
131199,,�����s,����,�����H����c���H�ւ̂����ߕ��i�u�����N�����Z���^�[�j�ߌ�̕�,���j���E�V���N�J�����E�W�V���N�w�m�X�X���J�^�i�V�����P���R�E�t�N�V�Z���^�[�j�S�S�m�u,,2022/12/20,2022/12/20,14:00,14:45,,"9��������1��6�����̂��q����̕ی�҂̕��ɁA�����H�㔼����c���H�ւ̂����ߕ��ɂ��āA�u�`�Ɨ����Љ�A�����W���̍u�K����J�Â��܂��B	9�������痣������������̐H�ނ̌`�ԁA�傫���A�����Ȃ�	��l�ƈꏏ�ɐH�ׂ闣���H	��Â��ݐH��",,,,,,,�u�����N�����Z���^�[�i�@��2-5-5�j,,,,,,,,,,,/1000779/1000809/1000820/1040496.html,
131199,,�����s,����,�͂��߂Ă̎��݂����Ђ��,�n�W���e�m�n�~�K�L�q���o,,2022/12/16,2022/12/16,10:20,11:30,,�����̂������Ƃނ����\�h�̂��b�ʎ��݂������k���Ȉ�t�ɂ��ی�҂̌��o���`�F�b�N�Ǝ��ȑ��k,,,,,,,���������N�����Z���^�[,,,,,,,,2022/12/15,,,/1000779/1000809/1000821/1022617.html,
131199,,�����s,����,�b�����E���낤�E�݂�Ȃ̌����`�������߂���q�ǂ������̐������ƂɁ`,�n�i�\�E�E�c�N���E�E�~���i�m�R�E�G���`�R�E�G�������O���R�h���^�`�m�R�G�����g�j�`,,2022/10/2,2022/10/2,14:00,16:00,,�@�ߘa3�N�x�ɑ����Ȃɂ��������������旧���E���w�Z10�Z1500�l�̎q�ǂ������̋��͂𓾂Ă����Ȃ��܂����B�{�t�H�[�����ł͂��̌��������̌��ʕ񍐂����Ƃɂ��Ďq�ǂ��������猩���������߂��錻��Ɖۑ�����L���܂��B�����āA�v�t������̎q�ǂ������A�n��̑�l��ی�ҁA�������p�҂������������O���[�v���[�N��ʂ��āA���ꂩ��̌�����R�~���j�e�B�[�̂�����ɂ��ċ��ɍl���܂��B���_�̉ߒ��Ŏq�ǂ��̈ӌ��Q������������A�����㋤���̒n��Â���ɂȂ��Ă��������Ǝv���܂��B,,,,,,,�匴���U�w�K�Z���^�[,,,,,,,,2022/9/30,,,/1000779/1000922/1000927/1040913.html,
131199,,�����s,����,�܂Ȃہ[�Ɛ����t�F�X�^,�}�i�|�[�g�i���}�X�t�F�X�^,,2022/6/19,2022/6/19,10:00,15:30,,���Z���^�[�𗘗p����T�[�N���̐��ʔ��\�C�x���g�i�X�e�[�W���\�A��i�W���A�̌��R�[�i�[�j,,,,,,,�������U�w�K�Z���^�[,,,,,,,,,,,/1000779/1000922/1000927/1038645.html,
131199,,�����s,����,���̒n�}�ƊX�����Ő����E�Ԓ˒n��̒n�`��m�낤,���b�^�C�`�Y�g�}�`�A���L�f�i���}�X�E�A�J�c�J�`�C�L�m�`�P�C���V���E,,2022/3/5,2022/3/5,14:00,16:00,,�݂Ȃ���A�����E�Ԓ˒n��Ƃ��̎��ӂ̂��Ƃ͂ǂꂭ�炢�m���Ă��܂����H�����E�Ԓ˂͐̂ǂ�ȏꏊ���������H���Ӓn��͂ǂ�Ȓn�`���H�ǂ�ȃX�|�b�g������̂��H�n�w�͂ǂ��Ȃ��Ă���̂��H�Ȃǂ��݂Ȃ���ƈꏏ�Ɋw��ł����܂��傤�B3��5���i�y�j���j�͗��̒n�}���A3��6���i���j���j�͂܂Ȃہ[�Ɛ������狽�y�����ق܂ŊX���������܂��B�X�����̓A�b�v�_�E�����������̂ŁA�����₷�������ł��Q�����������B���́F3��6���i���j���j�u�����΂��܂����F�̉�v�A�u���旧���y�����فv,,,,,,,�܂Ȃہ[�Ɛ���,,,,,,,,2022/3/5,,,/1000779/1000922/1000927/1037352.html,
131199,,�����s,����,���̒n�}�ƊX�����Ő����E�Ԓ˒n��̒n�`��m�낤,���b�^�C�`�Y�g�}�`�A���L�f�i���}�X�E�A�J�c�J�`�C�L�m�`�P�C���V���E,,2022/3/6,2022/3/6,13:00,16:00,,�݂Ȃ���A�����E�Ԓ˒n��Ƃ��̎��ӂ̂��Ƃ͂ǂꂭ�炢�m���Ă��܂����H�����E�Ԓ˂͐̂ǂ�ȏꏊ���������H���Ӓn��͂ǂ�Ȓn�`���H�ǂ�ȃX�|�b�g������̂��H�n�w�͂ǂ��Ȃ��Ă���̂��H�Ȃǂ��݂Ȃ���ƈꏏ�Ɋw��ł����܂��傤�B3��5���i�y�j���j�͗��̒n�}���A3��6���i���j���j�͂܂Ȃہ[�Ɛ������狽�y�����ق܂ŊX���������܂��B�X�����̓A�b�v�_�E�����������̂ŁA�����₷�������ł��Q�����������B���́F3��6���i���j���j�u�����΂��܂����F�̉�v�A�u���旧���y�����فv,,,,,,,�܂Ȃہ[�Ɛ���,,,,,,,,2022/3/5,,,/1000779/1000922/1000927/1037352.html,
131199,,�����s,����,���̒n�}�Œn���̒n�`��m�낤,���b�^�C�`�Y�f�W���g�m�`�P�C���V���E,,2022/7/31,2022/7/31,13:30,16:00,,"����-����n��A�u��-������n��̒n�`�ɂ��Ĉꏏ�Ɋw��ł����܂��B	�����̒n���̒n�`�͂ǂ��Ȃ��Ă���񂾂낤�H	�ׂ̊X�̒n�`���C�ɂȂ�	�����̒n����Ăǂꂭ�炢�̍����Ȃ񂾂낤�H�ȂǁA����-����n���u��-������n��̂��Ƃ������Ɨ������āA���y�ɂ��Ċ֐S�������������Â����ړI�Ƃ��Ă��܂��B&nbsp;7��31���͓���-����n��̗��̒n�}���A8��7���͎u��-������n��̗��̒n�}�����s���܂��B",,,,,,,�܂Ȃہ[�Ɛ����@�w�K��-2,,,,,,,,2022/7/30,,,/1000779/1000922/1000927/1039032.html,
131199,,�����s,����,���̒n�}�Œn���̒n�`��m�낤,���b�^�C�`�Y�f�W���g�m�`�P�C���V���E,,2022/8/7,2022/8/7,13:30,16:00,,"����-����n��A�u��-������n��̒n�`�ɂ��Ĉꏏ�Ɋw��ł����܂��B	�����̒n���̒n�`�͂ǂ��Ȃ��Ă���񂾂낤�H	�ׂ̊X�̒n�`���C�ɂȂ�	�����̒n����Ăǂꂭ�炢�̍����Ȃ񂾂낤�H�ȂǁA����-����n���u��-������n��̂��Ƃ������Ɨ������āA���y�ɂ��Ċ֐S�������������Â����ړI�Ƃ��Ă��܂��B7��31���͓���-����n��̗��̒n�}���A8��7���͎u��-������n��̗��̒n�}�����s���܂��B",,,,,,,�܂Ȃہ[�Ɛ����@�w�K��-2,,,,,,,,2022/7/30,,,/1000779/1000922/1000927/1039032.html,
131199,,�����s,����,�D������邨����,�X�L���J�^���I�`���J�C,,2021/9/18,2021/9/18,15:00,17:00,,�Ȃ�ƂȂ��F�B�ɘb���Â炢���ƁA�e�ɂ͌����Ȃ����ƁA������ƋC�ɂȂ邾���̂��Ɓc�c������ׂ肵�Ă݂܂��񂩁H����̃e�[�}�́u�����̍D���ȂƂ����b����!�v�u�D���v����邨����́A���S���āu�D���v�������ł��B���Ȃ��́u�D���v�ɂ��Č���Ă݂܂��񂩁H�����Ă��邾���ł�OK�I���Ђ��Q�����������B,,,,,,,�܂Ȃہ[�Ɛ���,,,,,,,,2021/9/18,,,/1000779/1000922/1000927/1033577.html,
131199,,�����s,����,�y���~�z�����΂��{�����e�B�A�E�s�������t�H�[����,�y�`���E�V�z�C�^�o�V�{�����e�B�A�E�V�~���J�c�h�E�t�H�[����,,2020/4/18,2020/4/18,17:30,19:30,,�n��ɕ�炷�l�X�ȋ���A�����I�w�i�A���x�̈Ⴂ�������āA���݂ɗ������������Ƃ��瑽���������Љ�̎����ւ̑������n�܂�B�����ŁA�g�߂Ȓn��ɏZ�ރA�t���J�̗��w���Ƃ̌𗬂ɂ��A�u�ǂ��E�܂ȂԁE�ނ��сv���n�߂݂܂��񂩁B���F�܂Ȃہ[�Ƒ匴�i�匴���U�w�K�Z���^�[�j���N���[�V�����z�[���u�t�F�鋞��w��w�@���O�q���w�����ȋ��� �R�{�G��SDGs�l�b�g���[�N�����΂���\ �����ד����c���@�l�{�����e�B�A�E�s�������w�K���i�Z���^�[������ �A���J�Y�q�ΏہF�ǂȂ��ł�����F60��,,,,,,,,,,,,,,,,,,/1000779/1000922/1000927/1021892.html,
131199,,�����s,����,�y���~�z�����΂��{�����e�B�A�E�s�������t�H�[����,�y�`���E�V�z�C�^�o�V�{�����e�B�A�E�V�~���J�c�h�E�t�H�[����,,2020/4/19,2020/4/19,9:00,10:00,,�n��ɕ�炷�l�X�ȋ���A�����I�w�i�A���x�̈Ⴂ�������āA���݂ɗ������������Ƃ��瑽���������Љ�̎����ւ̑������n�܂�B�����ŁA�g�߂Ȓn��ɏZ�ރA�t���J�̗��w���Ƃ̌𗬂ɂ��A�u�ǂ��E�܂ȂԁE�ނ��сv���n�߂݂܂��񂩁B���F�܂Ȃہ[�Ƒ匴�i�匴���U�w�K�Z���^�[�j���N���[�V�����z�[���u�t�F�鋞��w��w�@���O�q���w�����ȋ��� �R�{�G��SDGs�l�b�g���[�N�����΂���\ �����ד����c���@�l�{�����e�B�A�E�s�������w�K���i�Z���^�[������ �A���J�Y�q�ΏہF�ǂȂ��ł�����F60��,,,,,,,,,,,,,,,,,,/1000779/1000922/1000927/1021892.html,
131199,,�����s,����,�q�ǂ��̂��߂̗����Z�~�i�[,�R�h���m�^���m���R���Z�~�i�[,,2022/12/13,2022/12/13,10:00,12:00,,��1���@�����^���P�A���ɂ��đ�2���@�����������ɂ��đ�3���@����̂ЂƂ�e�ƒ�x�����x�̂��ē�,,,,,,,�I�����C����c�V�X�e���@Zoom,,,,,,,,2022/12/6,,,/kosodate/hitorioya/1041615.html,
131199,,�����s,����,�ߘa4�N�x��2�񌤏C��u������Ƃ͂�������Α��v�I�w�E�Y�f�̊�b�Ǝ��g�݁x�v,���C��4�l���h�_�C2�J�C�P���V���E�J�C�u�`���E�V���E�L�M���E�n�R���������o�_�C�W���E�u�I�w�_�c�^���\�m�L�\�g�g���N�~�x�v,,2022/12/14,2022/12/14,15:00,16:30,,���{���{��2050�N�܂łɉ������ʃK�X�̔r�o��S�̂Ƃ��ă[���ɂ���A�J�[�{���j���[�g������ڎw�����Ƃ�錾���܂����B����ɂ��A���Ƃ��͂��ߑ����̊�Ƃł��E�Y�f�Ɍ��������g�݂����ڂ���Ă��܂��B�����Łu�E�Y�f�̊�b�Ǝ��g�݁v���e�[�}�Ƃ��A������Ƃ��E�Y�f�Ɍ����Ăǂ̂悤�Ɏ��g��ł����ׂ����𕪂���₷��������܂��B,,,,,,,��ʎВc�@�l���Y�ƘA����i��1-48-11���W�G�r��No.3 2�K�j,,,,,,,,2022/12/12,,,/bousai/kankyo/ondanka/kenshu/1042316.html,
131199,,�����s,����,�ߘa4�N�x��1�񌤏C��u�C��ϓ�����Ђɋy�ڂ��e���Ƌ��߂���Ή��v,���C��4�l���h�_�C1�J�C�P���V���E�J�C�u�L�R�E�w���h�E�K�J�C�V���j�I���{�X�G�C�L���E�g���g���������^�C�I�E�v,,2022/7/28,2022/7/28,15:00,17:00,,�����ł̖ҏ���䕗�A�^���Ȃǂ̋C��ϓ��̉e���ɂ���Q��h�~�A�y�����Ă������߂̑Ή������Ə�ł����߂��Ă��Ă��܂��B�����ŁA�u�C��ϓ�����Ђɋy�ڂ��e���Ƌ��߂����Ή��ɂ��āv������܂��B,,,,,,,��ʎВc�@�l���Y�ƘA����i��1-48-11���W�G�r��No.3 2�K�j,,,,,,,,2022/7/25,,,/bousai/kankyo/ondanka/kenshu/1040016.html,
131199,,�����s,����,�ߘa3�N�x��4�񌤏C��u���w�����΍�̓����ɂ��āv,���C��3�l���h�_�C4�J�C�P���V���E�J�C�u�J�K�N�u�b�V�c�^�C�T�N�m�h�E�R�E�j�c�C�e�v,,2022/3/11,2022/3/11,15:00,16:00,,�J�����S�q���@�̈ꕔ�����Ȃǂɂ��ύX�̂��������w�����΍�̓����ɂ��ĉ�����܂��B,,,,,,,��ʎВc�@�l���Y�ƘA����i��1-48-11���W�G�r��No.3 2�K�j,,,,,,,,2022/3/8,,,/bousai/kankyo/ondanka/kenshu/1037560.html,
131199,,�����s,����,�ߘa3�N�x��3�񌤏C��u�G�l���M�[���p�̊ϓ_�ɂ����钆����Ƃ��Ή����ׂ��J�[�{���j���[�g�����v,���C��3�l���h�_�C3�J�C�P���V���E�J�C�u�G�l���M�[�����E�m�J���e���j�I�P���`���E�V���E�L�M���E�K�^�C�I�E�X�x�L�J�[�{���j���[�g�����v,,2021/12/15,2021/12/15,14:00,16:00,,����A�J�[�{���j���[�g�����ɑΉ����Ă����ɂ������ĕK�v�ƂȂ�A�E�Y�f�ɌW��g�g�݂␭��̑S�̑��A���B�G�l���M�[���ăG�l������ۂ̒�����Ƒ��̃����b�g�E�Ӌ`�Ȃǂɂ��ĉ�����܂��B,,,,,,,���Y�A��� 3�K��c���i���h54-10�j,,,,,,,,2021/12/10,,,/bousai/kankyo/ondanka/kenshu/1036357.html,
131199,,�����s,����,�ߘa3�N�x��2�񌤏C���SDGs��b�Z�~�i�[��,���C��3�l���h�_�C2�J�C�P���V���E�J�C��SDGs�L�\�Z�~�i�[��,,2021/10/8,2021/10/8,14:00,16:00,,SDGs�̊�b����A���ƂƂ̂������܂ŁA���߂Ď��g�܂��������ɁA�ŐV�������g������܂����ĉ�����܂��B,,,,,,,���Y�A��� 3�K��c���i���h54-10�j,,,,,,,,2021/10/4,,,/bousai/kankyo/ondanka/kenshu/1035095.html,
131199,,�����s,����,�ߘa3�N�x��1�񌤏C���G�l���M�[������߂���ŋ߂̓����ƍ���̕�������,���C��3�l���h�_�C1�J�C�P���V���E�J�C��G�l���M�[�Z�C�T�N�����O���T�C�L���m�h�E�R�E�g�R���S�m�z�E�R�E�Z�C��,,2021/6/18,2021/6/18,14:00,16:00,,2050�N�J�[�{���j���[�g�����̎����Ɍ����āA2030�N�܂łɉ������ʃK�X��46���팸�i2013�N�x��j������Ɣ��\������܂����B���ꂩ��啝�ȉ������ʃK�X�팸�����߂���G�l���M�[����ɁA���Ə��͂ǂ��Ή����Ă����ׂ����Ȃǂɂ��āA������܂��B,,,,,,,���Y�A��� 3�K��c���i���h54-10�j,,,,,,,,2021/6/15,,,/bousai/kankyo/ondanka/kenshu/1032783.html,
131199,,�����s,����,��R�w���Ӓn��܂��Â���p�l���W�y�ߘa3�N11��30���܂ŊJ�Ò��I�z,�I�I���}�G�L�V���E�w���`�N�}�`�d�N���p�l���e���y���C��3�l��11�K�c30�j�`�}�f�J�C�T�C�`���E�I�z,,2021/11/25,2021/11/30,9:00,17:00,,"��R�w���ӂ̊e�܂��Â��莖�ƂɊւ���p�l�����W���y�W�����e�z	�v���̈ʒu�Â�	�n��v��	�w�O�L�ꐮ�����Ɓi�����X�H��9�����j	�s�X�n�ĊJ������	�s�R�����i���萮���n��i�s�R������j	�s�s�v�擹�H�⏕��26����	�⏕��26�����Ɖ����܂��Â��葊�k�����E�������R�[�f�B�l�[�g	��R�w���n��̂ɂ��킢�̎�g",,,,,,,������k��1�K�C�x���g�X�N�G�A,,,,,,,,,,,/bousai/machidukuri/chiiki/1006312/1035576.html,
131199,,�����s,����,�e�q�Ŕ_�Ƒ̌�(��P��),�I���R�f�m�E�M���E�^�C�P��(�_�C�P�J�C),,2022/10/30,2022/10/30,10:00,12:00,,��1��@�T�c�}�C���̎��n�@���n�����T�c�}�C���̂�𗘗p�������[�X���@�ق���񑐂̎�܂���2��@�ق���񑐂̕c�̐A���t���@��1��ō쐬�������[�X�̏������3��@�ق���񑐂̎��n�@���ɂ��肪�Ƃ��I�t�Ɍ����Ĕ��̏����i���Z�ƍu�`�j,,,,,,,�ԒːA����[���p�ē��E��ʈē�],,,,,,,,2022/9/7,,,/bousai/kouen/kouen/akatsuka/1034112.html,
131199,,�����s,����,�e�q�Ŕ_�Ƒ̌��i��2��j,�I���R�f�m�E�M���E�^�C�P���i�_�C2�J�C�j,,2022/11/20,2022/11/20,10:00,12:00,,��1��@�T�c�}�C���̎��n�@���n�����T�c�}�C���̂�𗘗p�������[�X���@�ق���񑐂̎�܂���2��@�ق���񑐂̕c�̐A���t���@��1��ō쐬�������[�X�̏������3��@�ق���񑐂̎��n�@���ɂ��肪�Ƃ��I�t�Ɍ����Ĕ��̏����i���Z�ƍu�`�j,,,,,,,�ԒːA����[���p�ē��E��ʈē�],,,,,,,,2022/9/7,,,/bousai/kouen/kouen/akatsuka/1034112.html,
131199,,�����s,����,�e�q�Ŕ_�Ƒ̌��i��3��j,�I���R�f�m�E�M���E�^�C�P���i�_�C3�J�C�j,,2023/1/28,2023/1/28,13:30,15:15,,��1��@�T�c�}�C���̎��n�@���n�����T�c�}�C���̂�𗘗p�������[�X���@�ق���񑐂̎�܂���2��@�ق���񑐂̕c�̐A���t���@��1��ō쐬�������[�X�̏������3��@�ق���񑐂̎��n�@���ɂ��肪�Ƃ��I�t�Ɍ����Ĕ��̏����i���Z�ƍu�`�j,,,,,,,�ԒːA����[���p�ē��E��ʈē�],,,,,,,,2022/9/7,,,/bousai/kouen/kouen/akatsuka/1034112.html,
131199,,�����s,����,�ό��A�v���uITA-�}�j�A�v�f�W�^���X�^���v�����[�J�Âɂ���,�J���R�E�A�v���uITA-�}�j�A�v�f�W�^���X�^���v�����[�J�C�T�C�j�c�C�e,,2022/9/28,2023/1/18,,,,"	�{�y�[�W�����ɂ���񎟌��R�[�h����A�ό��A�v���uITA-�}�j�A�v���_�E�����[�h���Ă��������B	�J�Ê��Ԓ��ɃX�^���v�ݒu�{�݁i���18�{�݁j���܂��A�f�W�^���X�^���v���W�߂Ă��������B�i�f�W�^���X�^���v�́A�e�{�݂ɐݒu���Ă���񎟌��R�[�h���A�v�����N�����ēǂݍ��ނ��ƂŏW�߂邱�Ƃ��o���܂��B�j	�f�W�^���X�^���v����萔�W�߂�ƁA���I�őf�G�ȏܕi��������܂��B�i�X�^���v2��1���ډ���A�X�^���v4��2���ډ���A�X�^���v6��3���ډ���\�ł��B�ő�3������\�B�ܕi�͂��I�тł��܂���̂ŗ\�߂��������������B�j	�R���v���[�g�܂Ƃ��āA���ׂĂ̎{�݁i18�{�݁j�̃X�^���v���W�߂����撅200���l�ɑf�G�ȃv���[���g��p�ӂ��Ă��܂��B�R���v���[�g�܂́A�����΂��ό��Z���^�[�ł��n�����܂��B",,,,,,,�X�^���v�ݒu�{�݁i��������{�ݓ�18�{�݁j�A���L�O����X�|�[�c�Z���^�[�i�������̈�فj�i����1-10-5�j�A���`���فi����1-10-5�j�����΂��ό��Z���^�[�i��3-14-15�j�����ǂ��������i��3-50-1�@�����������j�ܕēX�i���h40-1�j������̈�فi������3-1-1�j�G�R�|���X�Z���^�[�i�O�쒬4-6-1�j����̈�فi����1-3-1�j�����}���فi��Ց�4-3-1�j����Ȋw�فi��Ց�4-14-1�j���p�فi�Ԓ�5-34-27�j�Ԓˑ̈�فi�Ԓ�5-6-1�j�ԒːA�����i�Ԓ�5-17-14�j���y�����فi�Ԓ�5-35-25�j�����������v�[���i������8-28-1�j�M�ъ��A���فi������8-29-2�j���ǂ��������E�����������i������8-24-1���ۃP���������j���T�C�N���v���U�i�M�n4-16-6�j�E�ꏊ�̏ڍׂ��ẮA�ǂ��i�r�����΂��i�O�������N�j�ł��m�F���������B,,,,,,,,,,,/kusei/profile/kanko/joho/1026826.html,
131199,,�����s,����,�ό��A�v���uITA-�}�j�A�v�t�H�g����R���e�X�g�J�Âɂ���,�J���R�E�A�v���uITA-�}�j�A�v�t�H�g�Z�������E�R���e�X�g�J�C�T�C�j�c�C�e,,2022/10/11,2022/11/30,,,,�uITA-�}�j�A�v�͋���̂������߃X�|�b�g��A�O�������̌����A�U�􃋁[�g�̎����쐬�Ȃǁg�������Ǝ��̂��y���߂�h�A�v���ł��B�uITA-�}�j�A�v���g���āA���L�̓����ŁA�u�a��h��v���e�[�}�Ƀt�H�g����R���e�X�g���J�Â��܂��B�uITA-�}�j�A�v���̃J�����@�\���g���āA���͕t���̎ʐ^���B�邱�Ƃ��ł��܂��B�ʐ^���B���Ċ��������ƂȂǂ����ɂ��āA�ʐ^�ƈꏏ�ɉ��債�Ă��������B���傢��������������I�΂ꂽ��i�́A����z�[���y�[�W��SNS�Ɍf�ڂ��A�f�G�ȏܕi��������܂��B��̖��͂��Ĕ����ł���uITA-�}�j�A�v���_�E�����[�h���āA���񂱂̋@��ɁA�t�H�g����R���e�X�g�ɂ��Q���������B,,,,,,,,,,,,,,,,,,/kusei/profile/kanko/joho/1040294.html,
131199,,�����s,����,��31�񐬑����w�܂�,�_�C31�J�C�i���}�X�h�E���E�}�c��,,2022/10/8,2022/10/8,13:30,16:30,,�C�x���g�̏ڍׂ́A�y�[�W�����̊֘A�����N����{�����������B,,,,,,,�����A�N�g�z�[��[�����A�N�g�z�[���@�����p�ē��E�\���ݕ��@],,,,,,,,,,,/kusei/profile/event/chiku/1040515.html,
131199,,�����s,����,�����n�抈�����{�s,�V�~�Y�`�C�L�J�c�h�E�~�z���C�`,,2022/12/4,2022/12/4,11:00,16:00,,,,,,,,,�܂Ȃہ[�Ƒ匴,,,,,,,,,,,/kyoikuiinkai/shogai/manaport/ohara/1042294.html,
131199,,�����s,����,����I�ۑ�̊w�K�@�������Ƃƈ玙���l����,�Q���_�C�e�L�J�_�C�m�K�N�V���E�@�n�^���N�R�g�g�C�N�W���J���K�G��,,2022/11/12,2022/11/12,10:00,12:00,,�Q�������F����ŃI�[�v���ȕ��͋C���؂ɂ��Ȃ���b�����������܂��B�u�Ǝ��E�玙�E�d���Ƃ�邱�Ƃ������X�P�W���[������������v����ȕs��������Ă�������������鍡�B���u���ł́A�S�Ɛg�̂̌��N�⎞�ԏp�A�����Ď������ŉƑ��ƌ����������@�ɂ��đΘb�����Ȃ���A�l���܂��傤�B���l�ȉƑ��̌`�A�������̂��钆�ŁA���������ĉƑ��ɂƂ��Ă̐����₷�����������ꏏ�ɍl���Ă����܂��傤�B�e�񂾂��̎Q�����劽�}�ł��B,,,,,,,���U�w�K�Z���^�[�@�܂Ȃہ[�Ƒ匴,,,,,,,,2022/11/12,,,/kyoikuiinkai/shogai/manaport/ohara/1040878.html,
131199,,�����s,����,����I�ۑ�̊w�K�@�������Ƃƈ玙���l����,�Q���_�C�e�L�J�_�C�m�K�N�V���E�@�n�^���N�R�g�g�C�N�W���J���K�G��,,2022/12/4,2022/12/4,10:00,12:00,,�Q�������F����ŃI�[�v���ȕ��͋C���؂ɂ��Ȃ���b�����������܂��B�u�Ǝ��E�玙�E�d���Ƃ�邱�Ƃ������X�P�W���[������������v����ȕs��������Ă�������������鍡�B���u���ł́A�S�Ɛg�̂̌��N�⎞�ԏp�A�����Ď������ŉƑ��ƌ����������@�ɂ��đΘb�����Ȃ���A�l���܂��傤�B���l�ȉƑ��̌`�A�������̂��钆�ŁA���������ĉƑ��ɂƂ��Ă̐����₷�����������ꏏ�ɍl���Ă����܂��傤�B�e�񂾂��̎Q�����劽�}�ł��B,,,,,,,���U�w�K�Z���^�[�@�܂Ȃہ[�Ƒ匴,,,,,,,,2022/11/12,,,/kyoikuiinkai/shogai/manaport/ohara/1040878.html,
131199,,�����s,����,����I�ۑ�̊w�K�@�������Ƃƈ玙���l����,�Q���_�C�e�L�J�_�C�m�K�N�V���E�@�n�^���N�R�g�g�C�N�W���J���K�G��,,2022/12/10,2022/12/10,10:00,12:00,,�Q�������F����ŃI�[�v���ȕ��͋C���؂ɂ��Ȃ���b�����������܂��B�u�Ǝ��E�玙�E�d���Ƃ�邱�Ƃ������X�P�W���[������������v����ȕs��������Ă�������������鍡�B���u���ł́A�S�Ɛg�̂̌��N�⎞�ԏp�A�����Ď������ŉƑ��ƌ����������@�ɂ��đΘb�����Ȃ���A�l���܂��傤�B���l�ȉƑ��̌`�A�������̂��钆�ŁA���������ĉƑ��ɂƂ��Ă̐����₷�����������ꏏ�ɍl���Ă����܂��傤�B�e�񂾂��̎Q�����劽�}�ł��B,,,,,,,���U�w�K�Z���^�[�@�܂Ȃہ[�Ƒ匴,,,,,,,,2022/11/12,,,/kyoikuiinkai/shogai/manaport/ohara/1040878.html,
131199,,�����s,����,�y�������}���فz�N���X�}�X�l�`���@,�y�^�J�V�}�_�C���g�V���J���z�N���X�}�X�j���M���E�Q�L�@,,2022/12/18,2022/12/18,14:00,15:00,,����l�`���̉�u�|���y���|�b�T�v�ɂ��l�`��,,,,,,,�������}���ف@�����o��,,,,,,,,,,,/kosodate/1000930/etc/1041180.html,
131199,,�����s,����,�y�Ԓː}���فz�X�N���[��DE���͂Ȃ���@,�y�A�J�c�J�g�V���J���z�X�N���[��DE�I�n�i�V�J�C�@,,2022/12/3,2022/12/3,14:00,15:00,,��^�X�N���[���ɊO����̊G�{�𓊉e���Ă̓ǂݕ�����,,,,,,,�Ԓː}���ف@�����o��,,,,,,,,,,,/kosodate/1000930/etc/1041179.html,
131199,,�����s,����,�y�����}���فz�搧90���N�L�O�u�Q�Ό��X�^���v�����[�@�~�̐w�v,�y�q�K�V�C�^�o�V�g�V���J���z�N�Z�C90�V���E�l���L�l���u�T���L���R�E�^�C�X�^���v�����[�@�t���m�W���v,,2022/12/1,2023/1/30,,,,�{���؂�ăX�^���v�����[�ɒ���B�]�˂������܂ł̏h�꒬�����ׂď����ăS�[������ƃv���[���g������܂��B�B���҂Ƀv���[���g�������グ�܂��B,,,,,,,�����}����,,,,,,,,,,,/kosodate/1000930/etc/1041178.html,
131199,,�����s,����,�y�X��}���فz���ł���Ƃ�@,�y�q�J���g�V���J���z�����f�V���g���@,,2022/10/27,2022/11/29,,,,�}���قł��肽�{�ł���Ƃ�����悤�I����Ƃ����������Ȃ�����v���[���g�����炦�܂��B,,,,,,,�X��}����,,,,,,,,,,,/kosodate/1000930/etc/1040678.html,
131199,,�����s,����,���������₫�ۈ牀�@���₫�����̂Ђ��,�^�J�V�}�_�C���P���L�z�C�N�G���@�P���L�`�����m�q���o,,2022/12/1,2022/12/1,10:00,11:00,,�X�L���V�b�v�̎���V�т̏Љ��A���������痣���H�̘b�A�Ō�t���猒�N�ɂ��Ă̘b�ȂǍs���܂��B�ۈ牀���̌��w���ł��܂��B,,,,,,,���������₫�ۈ牀,,,,,,,,,,,/kosodate/azukeru/ninka/annai/hoikuen/keyaki/1015572/1041933.html,
131199,,�����s,����,�y�����}���فz�G�{�̂܂����@�u����V���[�Y�u���E�̏��I����v,�y�`���E�I�E�g�V���J���z�G�z���m�}�`�C�^�o�V�@�R�E�G���J�C�V���[�Y�u�Z�J�C�m�V���_�i�J���v,,2022/12/23,2022/12/23,18:00,19:30,,,,,,,,,�����}���ف@1�K�}���كz�[��,,,,,,,,,,,/bunka/bunka/1019950/1020073/1038545.html,
131199,,�����s,����,�y�����}���فz�G�{�̂܂����@�u����V���[�Y�uOn the table�v,�y�`���E�I�E�g�V���J���z�G�z���m�}�`�C�^�o�V�@�R�E�G���J�C�V���[�Y�uOn the table�v,,2022/12/10,2022/12/10,15:00,16:30,,,,,,,,,�����}���ف@1�K�}���كz�[��,,,,,,,,,,,/bunka/bunka/1019950/1020073/1038555.html,
131199,,�����s,����,�y�����}���فz�G�{�̂܂����@�u����V���[�Y�uOn the table�v,�y�`���E�I�E�g�V���J���z�G�z���m�}�`�C�^�o�V�@�R�E�G���J�C�V���[�Y�uOn the table�v,,2023/1/14,2023/1/14,15:00,16:30,,,,,,,,,�����}���ف@1�K�}���كz�[��,,,,,,,,,,,/bunka/bunka/1019950/1020073/1038555.html,
131199,,�����s,����,�y�����}���فz�I���W�i�����󒠂����낤�I�@2022�N12��17��,�y�i���}�X�g�V���J���z�I���W�i���S�V���C���`���E���c�N���E�I�@2022�l��12�K�c17�j�`,,2022/12/17,2022/12/17,14:00,14:45,,��ނ̐F���̒�����D���ȕ���I��ŁA�I���W�i�����󒠂�����܂��B,,,,,,,�����A�[�g�M�������[,,,,,,,,,,,/bunka/bunka/1019950/1020073/1041177.html,
131199,,�����s,����,�y�X��}���فz�̂��� �w�ڂ� ��b�\���O���C�u�@2022�N12��11��,�y�q�J���g�V���J���z�E�^�I�E �}�i�{�E �V�����\���O���C�u�@2022�l��12�K�c11�j�`,,2022/12/11,2022/12/11,14:00,15:00,,�吳��w��b�T�[�N���ɂ���b�Ɖ̂��������N���X�}�X�R���T�[�g,,,,,,,�X��}���ف@�����o��,,,,,,,,,,,/bunka/bunka/1019950/1020073/1041175.html,