�s���{���R�[�h���͎s�撬���R�[�h,NO,�s���{����,�s�撬����,�C�x���g��,�C�x���g��_�J�i,�C�x���g��_�p��,�J�n��,�I����,�J�n����,�I������,�J�n�������L����,����,����(��{),����(�ڍ�),�A���於��,�A����d�b�ԍ�,�A��������ԍ�,��Î�,�ꏊ����,�Z��,����,�ܓx,�o�x,�A�N�Z�X���@,���ԏ���,���,�Q���\���I����,�Q���\���I������,�Q���\�����@,URL,���l
131199,,�����s,����,�����a�̂ǂ����J�Â��܂�,�C�^�o�V�w�C���m�c�h�C���J�C�T�C�V�}�X,,2023/11/1,2023/11/1,17:00,19:15,,���敽�a�̓��i�Ёj�p���[�h���T�ɐ旧���A16������L���s�̕��a�̓��i�Ƃ����сj�ƒ���s�̐����̉΂����킹�č̉΂����u���敽�a�̓��i�Ёj�v�̃p���[�h�i������`�旧������فj���s���܂��B��1���@�錾���N�Ǒ�1�� �u���w�����a�̗��v�̌����\8���ɒ��w�����a�̗��ɎQ���������w�����O���[�v���ƂɊw�K���\���s���܂��B��2���@��������q����̘N�ǂƂ��b �`�s�A�j�X�g�����r�Ƃ���ɂ�鉉�t�`���ځF�w���͌��Ă��� �S�ł����q���V�}�ꒆ��N���E�����L�W�E1�ҁx�u�����ŁA�q�ǂ���S��������e�̎�L�v���s�A�j�X�g�����r�Ƃ���̉��t�ɂ����������y�ƃI���W�i���f���ɂ��킹�A��������q���񂪘N�ǂ��܂��B�X�N���[���ɂ́A�z�����܂ꂻ���ȉʂĂ��Ȃ����󂪍L����܂��B���̈���ŁA��u�ɂ��Ė���D��ꂽ���k�����̈�i��L����ʂ�̌��݂̉f�����f���o����܂��B�u���a�G��E�����W�v�D�G�ܕ\�������E���w�����u���a�Ɛ푈�v���e�[�}�ɕ`�����G��E�|�X�^�[�̗D�G�ܕ\���������{���܂��B,,,,,,,�旧������ّ�z�[��,,,,,,,,,,,/1000779/1000788/1000789/1047874.html,
131199,,�����s,����,�����΂������������~�[�e�B���O�i�����΂������{�����e�B�A�Z���^�[���Ɓj,�C�^�o�V�^�u���J�L���E�Z�C�~�[�e�B���O�i�C�^�o�V�\�E�S�E�{�����e�B�A�Z���^�[�W�M���E�j,,2023/10/5,2023/10/5,15:00,17:00,,�O���Ƀ��[�c�̂���q�ǂ����x�����邽�߂̎��ጟ���E��������,,,,,,,�����΂������{�����e�B�A�Z���^�[,,,,,,,,,,,/1000779/1000799/1000800/1048896.html,
131199,,�����s,����,�{�����e�B�A�c�́ENPO�@�l�ݗ��u���i�����΂������{�����e�B�A�Z���^�[��Î��Ɓj,�{�����e�B�A�_���^�C�ENPO�z�E�W���Z�c���c�R�E�U�i�C�^�o�V�\�E�S�E�{�����e�B�A�Z���^�[�V���T�C�W�M���E�j,,2023/7/15,2023/7/15,13:30,16:30,,�{�����e�B�A�c�̐ݗ��ɕK�v�Ȃ��ƁE�^�c���@�Ȃ�,,,,,,,�����΂������{�����e�B�A�Z���^�[,,,,,,,,,,,/1000779/1000799/1000800/1047152.html,
131199,,�����s,����,�{�����e�B�A�c�́ENPO�@�l�ݗ��u���i�����΂������{�����e�B�A�Z���^�[��Î��Ɓj,�{�����e�B�A�_���^�C�ENPO�z�E�W���Z�c���c�R�E�U�i�C�^�o�V�\�E�S�E�{�����e�B�A�Z���^�[�V���T�C�W�M���E�j,,2023/7/22,2023/7/22,13:30,16:30,,NPO�@�l�ݗ��̂��߂̎葱�����@�E����Љ�Ȃ�,,,,,,,�����΂������{�����e�B�A�Z���^�[,,,,,,,,,,,/1000779/1000799/1000800/1047152.html,
131199,,�����s,����,��32��O����܂�,�_�C32�J�C�}�G�m�T�N���}�c��,,2023/3/26,2023/3/26,10:30,15:00,,�I�[�v�j���O�Z�����j�[�i�ߑO10��30������j�O�ȘA���ɂ����邨�ՁA�ڔ��̉��t�ł��܂肪�X�^�[�g�������܂��B�������ۂɂ�鉉�t�A���͖��_�ł��I&nbsp;���T�i���߂���j&nbsp;�X�e�[�W�n��̎q�ǂ������ɂ��_���X��R�[���X�Ȃǂ����y���݂��������܂��B&nbsp;�����������A����𗬃R�[�i�[�̉������̑ʉَq�₨������Ȃǂ�����̔��������܂��B�����D���[���[��֓����Ȃǂ̗V�т��������܂��B&nbsp;�����كR�[�i�[�����قɂ����c���R�[�i�[�����p�ӂ��Ă���܂��B&nbsp;�O�앟�����R�[�i�[�������̎��吶�Y�i��W���̔����Ă���܂��B&nbsp;�������R�[�i�[�A�͋[�X�i�L���@�ߑO10��30�����甄�؂ꎟ��I���j����E������A�n���̏��X�X�APTA���A�؏`�E�Ă����΁E�Ă����E���炠���Ȃǂ��o�X�������܂��B�ǂ�����������������̂ŁA�����ɔ���؂�Ă��܂��܂��B�����߂ɂǂ����I�I&nbsp;�O�ȃR�[�i�[�i�ߑO11��������)�ՂƎڔ��̉��t��������育�ӏ܂��������B&nbsp;�Ԕ������Еz��i�L���@�ߑO10��30�����甄�؂ꎟ��I���j���萔������Еz�������܂��B��D�]�ɂ������߂ɂǂ����I&nbsp;�W����R�[�i�[�i�G�R�|���X�Z���^�[2�K�j�G�R�|���X�Z���^�[�Ő����Ԃ�K���̓W������s���܂��B�����ő̌��ł���~�j�����ԃR�[�i�[������܂��̂ŁA���Ђ�������肭�������B,,,,,,,�O������i����O�쒬5-1-1)�J�V���́A�G�R�|���X�Z���^�[�i����O�쒬4-6-1�j�ŋK�͂��k�����Ď��{�������܂��B,,,,,,,,,,,/1000779/1000799/1000800/1045082.html,
131199,,�����s,����,�͂��߂Ă̎��݂����Ђ�΁i�����N�����Z���^�[�j,�n�W���e�m�n�~�K�L�q���o�i�C�^�o�V�P���R�E�t�N�V�Z���^�[�j,,2023/11/8,2023/11/8,10:20,11:30,,"	�q�ǂ��̎��݂������k�i�����̂ނ����\�h�Ǝ����j	�ی�ґΏۂ̎��ȑ��k",,,,,,,�����N�����Z���^�[,,,,,,,,,,,/1000779/1000809/1000817/1033519.html,
131199,,�����s,����,�����H����c���H�ւ̂����ߕ��i�Ԓˌ��N�����Z���^�[�j,���j���E�V���N�J�����E�W�V���N�w�m�X�X���J�^�i�A�J�c�J�P���R�E�t�N�V�Z���^�[�j,,2023/11/28,2023/11/28,10:00,11:00,,"�����H�㔼����c���H�ւ̂����ߕ��ɂ��āA�u�`�Ɨ����Љ�E���H�E�W�����s���܂��B	����������痣������������̐H�ނ̌`�ԁA�傫���A�����Ȃ�	��l�̐H�������蕪���č�闣���H	��Â��ݐH��",,,,,,,�Ԓˌ��N�����Z���^�[,,,,,,,,,,,/1000779/1000809/1000819/1040686.html,
131199,,�����s,����,�����H����c���H�ւ̂����ߕ��i�Ԓˌ��N�����Z���^�[�j,���j���E�V���N�J�����E�W�V���N�w�m�X�X���J�^�i�A�J�c�J�P���R�E�t�N�V�Z���^�[�j,,2023/11/28,2023/11/28,14:00,15:00,,"�����H�㔼����c���H�ւ̂����ߕ��ɂ��āA�u�`�Ɨ����Љ�E���H�E�W�����s���܂��B	����������痣������������̐H�ނ̌`�ԁA�傫���A�����Ȃ�	��l�̐H�������蕪���č�闣���H	��Â��ݐH��",,,,,,,�Ԓˌ��N�����Z���^�[,,,,,,,,,,,/1000779/1000809/1000819/1040686.html,
131199,,�����s,����,�u�����H����c���H�ւ̂����ߕ��v�i�u�`�E�����W���j���������N�����Z���^�[,�u���j���E�V���N�J�����E�W�V���N�w�m�X�X���J�^�v�i�R�E�M�E�����E���e���W�j�^�J�V�}�_�C���P���R�E�t�N�V�Z���^�[,,2023/12/1,2023/12/1,10:00,11:00,,"�����H�㔼����c���H�ւ̂����ߕ��ɂ��āA�u�`�Ɨ����Љ�E�W���E���H���s���܂��B	����������痣�����������̐H�ނ̌`�ԁA�傫���A���t���Ȃ�	��l�̐H�������蕪���č�闣���H	��Â��ݐH��",,,,,,,���������N�����Z���^�[[���N�����������@���������N�����Z���^�[],,,,,,,,,,,/1000779/1000809/1000821/1022595.html,
131199,,�����s,����,�͂��߂Ă̎��݂����Ђ��,�n�W���e�m�n�~�K�L�q���o,,2023/12/15,2023/12/1,10:20,11:30,,�q�ǂ��̎��݂������k�E�ی�҂̎��ȑ��k,,,,,,,���������N�����Z���^�[,,,,,,,,2023/12/15,,,/1000779/1000809/1000821/1022617.html,
131199,,�����s,����,�i�F�m�ǃT�|�[�^�[�Ώہj�F�m�ǃT�|�[�^�[�X�e�b�v�A�b�v�u��,�i�j���`�V���E�T�|�[�^�[�^�C�V���E�j�j���`�V���E�T�|�[�^�[�X�e�b�v�A�b�v�R�E�U,,2023/10/3,2023/10/3,9:40,11:40,,�F�m�ǃT�|�[�^�[�{���u������u���ꂽ�����Ώۂł��B�F�m�ǂ������Ă��Ȃ��Ă���炵�₷���n��Â����ڎw���āA�F�m�ǂɊւ���w�т�[�߂܂��B2�����̍u���ł����A1���݂̂̂��Q�����\�ł��B10��3���@�e�[�}�u�F�m�ǂ̗�����[�߁A�F�m�ǂƋ��ɐ�����l�X�ւ̐ڂ������w�ԁv10��12���@�e�[�}�u�n��ł̋��ꏊ�Â���`�F�m�ǃT�|�[�^�[�̊����`�v,,,,,,,�旧�O���[���z�[���@2�K�z�[��,,,,,,,,2023/9/25,,,/1000779/1000809/1000822/1048569.html,
131199,,�����s,����,�i�F�m�ǃT�|�[�^�[�Ώہj�F�m�ǃT�|�[�^�[�X�e�b�v�A�b�v�u��,�i�j���`�V���E�T�|�[�^�[�^�C�V���E�j�j���`�V���E�T�|�[�^�[�X�e�b�v�A�b�v�R�E�U,,2023/10/12,2023/10/12,9:40,11:40,,�F�m�ǃT�|�[�^�[�{���u������u���ꂽ�����Ώۂł��B�F�m�ǂ������Ă��Ȃ��Ă���炵�₷���n��Â����ڎw���āA�F�m�ǂɊւ���w�т�[�߂܂��B2�����̍u���ł����A1���݂̂̂��Q�����\�ł��B10��3���@�e�[�}�u�F�m�ǂ̗�����[�߁A�F�m�ǂƋ��ɐ�����l�X�ւ̐ڂ������w�ԁv10��12���@�e�[�}�u�n��ł̋��ꏊ�Â���`�F�m�ǃT�|�[�^�[�̊����`�v,,,,,,,�旧�O���[���z�[���@2�K�z�[��,,,,,,,,2023/9/25,,,/1000779/1000809/1000822/1048569.html,
131199,,�����s,����,�F�m�ǃT�|�[�^�[�{���u��,�j���`�V���E�T�|�[�^�[���E�Z�C�R�E�U,,2023/12/16,2023/12/16,14:00,15:30,,"�F�m�ǂ̏Ǐ��A�F�m�ǂ̂�����ւ̐ڂ����ɂ��Ċw�ׂ�u���ł��B��u���ꂽ���ɂ́A�u�킽���͔F�m�ǂ̐l���x�����܂��v�Ƃ����ӎu������킷�u�F�m�ǃT�|�[�^�[�J�[�h�v���v���[���g�I	�u�F�m�ǃT�|�[�^�[�v�Ƃ�	�F�m�ǂɂ��Đ������������A�F�m�ǂ̐l�₻�̉Ƒ�����������������鉞���҂̂��Ƃł��B�T�|�[�^�[���n��⒬��A���X�X�A���Z�@�ւȂǐ����̗l�X�ȂƂ���ɂ��āA������Ƃ����菕�����ł���΁A�F�m�ǂ̐l�₻�̉Ƒ������S���Ď���ŕ�炷���Ƃ��ł��܂��B	�u����҂��񂵂񋦗͓X�v�Ƃ�	�F�m�ǂɂȂ��Ă����S���ĕ�点��܂��Â���Ɏ^�����Ă���������A�F�m�ǃT�|�[�^�[�{���u������u���ꂽ�������������Ə��ł��i��Ë@�ցA��쎖�Ə��͑ΏۊO�j�B	�u�����C�����ꂽ������Ə��ւ́A�u����҂��񂵂񋦗͓X�v�X�e�b�J�[�����n�����A��̃z�[���y�[�W�Ɏ��Ə������f�ڂ��܂��B",,,,,,,���旧������ف@���c���i��R����51��1���j,,,,,,,,2023/12/15,,,/1000779/1000809/1000822/1047117.html,
131199,,�����s,����,�F�m�Ǎu����,�j���`�V���E�R�E�G���J�C,,2023/7/20,2023/7/20,14:00,15:30,,�u�F�m�ǂ̊�b�m���v���e�[�}�ɁA�F�m�ǂ̗\�h�⎡�ÂȂǂɂ��Ă��b���������܂��B�F�m�ǂɂ��Ċ֐S�̂�����A�S�z�ȕ����Ђ��Q�����������B,,,,,,,����O���[���z�[���@2�K�z�[��,,,,,,,,,,,/1000779/1000809/1000822/1047104.html,
131199,,�����s,����,�F�m�ǃT�|�[�^�[�{���u��,�j���`�V���E�T�|�[�^�[���E�Z�C�R�E�U,,2023/9/5,2023/9/5,14:00,15:30,,"�F�m�ǂ̏Ǐ��A�F�m�ǂ̂�����ւ̐ڂ����ɂ��Ċw�ׂ�u���ł��B��u���ꂽ���ɂ́A�u�킽���͔F�m�ǂ̐l���x�����܂��v�Ƃ����ӎu������킷�u�F�m�ǃT�|�[�^�[�J�[�h�v���v���[���g�I	�u�F�m�ǃT�|�[�^�[�v�Ƃ�	�F�m�ǂɂ��Đ������������A�F�m�ǂ̐l�₻�̉Ƒ�����������������鉞���҂̂��Ƃł��B�T�|�[�^�[���n��⒬��A���X�X�A���Z�@�ւȂǐ����̗l�X�ȂƂ���ɂ��āA������Ƃ����菕�����ł���΁A�F�m�ǂ̐l�₻�̉Ƒ������S���Ď���ŕ�炷���Ƃ��ł��܂��B	�u����҂��񂵂񋦗͓X�v�Ƃ�	�F�m�ǂɂȂ��Ă����S���ĕ�点��܂��Â���Ɏ^�����Ă���������A�F�m�ǃT�|�[�^�[�{���u������u���ꂽ�������������Ə��ł��i��Ë@�ցA��쎖�Ə��͑ΏۊO�j�B	�u�����C�����ꂽ������Ə��ւ́A�u����҂��񂵂񋦗͓X�v�X�e�b�J�[�����n�����A��̃z�[���y�[�W�Ɏ��Ə������f�ڂ��܂��B",,,,,,,�������斯�كz�[���i������3-12-28�j,,,,,,,,2023/9/4,,,/1000779/1000809/1000822/1047103.html,
131199,,�����s,����,��3��F�m�ǂ̕�����삷��Ƒ��̂��߂̍u��,�_�C3�J�C�j���`�V���E�m�z�E���J�C�S�X���J�]�N�m�^���m�R�E�U,,2023/7/26,2023/7/26,14:00,16:00,,�F�m�ǂ̕����\�Ȍ���Z�݊��ꂽ����܂��͒n��ł̐������p���ł���悤�A���T�[�r�X����肭���p���邽�߂̃q���g�����b�����������܂��B���p�ɂ������Ă̕s����^��𕷂��Ă݂܂��񂩁H,,,,,,,�O���[���z�[��601��c��,,,,,,,,2023/7/25,,,/1000779/1000809/1000822/1047105.html,
131199,,�����s,����,�������w����XR�̌��C�x���g,�^�J�V�}�_�C���G�L�V���E�w��XR�^�C�P���C�x���g,,2023/10/27,2024/2/18,,,,,,,,,,,�旧�M�ъ��A���ق���э������w����,,,,,,,,,,,/1000779/1000906/1000907/1049399.html,
131199,,�����s,����,�C�x���g����� in ����ʌ��� with niko�t�F�X,�C�x���g�_�C�W�b�P�� in �C�^�o�V�R�E�c�E�R�E�G�� with niko�t�F�X,,2023/6/3,2023/6/3,12:00,17:00,,����ʌ���(�������́F�������j�̍Đ����Ɍ����āA�Љ�����Ƃ��Č����}���V�F���J�Â��܂��B�L�b�`���J�[�⃏�[�N�V���b�v�̌��ȂǕ��L������̕����y���ނ��Ƃ��ł���C�x���g�ő����̋斯�ɏW�܂��Ă��炤�Ɠ����ɁA�Đ����Ɍ������ӌ�������������[���s���u�[�X��݂��A�����̖����ɂ��čl����@������邱�ƂŁA�斯��n��ƘA�g���Ȃ���Đ�����i�߂Ă����܂��B�ڍׂ͉��L����z�[���y�[�W���������������Bhttps://www.city.itabashi.tokyo.jp/bousai/kouen/kouen/1045207.html,,,,,,,�������i����ʌ����j�Z���F�����R����21-1[����ʌ���],,,,,,,,,,,/1000779/1000915/1000920/1046747.html,
131199,,�����s,����,��24�񂢂��΂��j�������t�H�[������u���u�h�ЁE���Ђɂ����K�v�ȃW�F���_�[�����̎��_�v,�_�C24�J�C�C�^�o�V�_���W���r���E�h�E�t�H�[�����L�`���E�R�E�G���u�{�E�T�C�E�Q���T�C�j�R�\�q�c���E�i�W�F���_�[�r���E�h�E�m�V�e���v,,2024/1/27,2024/1/27,14:00,16:30,,�ЊQ���A�S�g���ɂ��傫�Ȕ�Q���󂯂�͍̂���҂�Ⴊ���̂���l�����A������q�ǂ��ȂǁA�Љ�I�Ɏア����̐l�����ł��B�݂�Ȃ������c�邽�߂ɂ̓W�F���_�[�������͂��߂Ƃ��鑽�l�Ȏ��_�Ɋ�Â����x�����K�v�ł��B���Ў��Ɍ��n�̍ЊQ�󋵂�n�}��ɔ��f���x�������̃T�|�[�g������Ă���Ë��搶�Ƌ��ɁA�h�ЁE���Ђɂ��čl���܂��傤�B,,,,,,,���旧�O���[���z�[���@2�K�z�[��,,,,,,,,,,,/tetsuduki/jinken/danjo/kouza/1049363.html,
131199,,�����s,����,�q��ĂƉ�삪�����ɁI�H�]�_�u���P�A�Ǝd���̗����̃q���g�],�R�\�_�e�g�J�C�S�K�h�E�W�j�I�H�]�_�u���P�A�g�V�S�g�m�����E���c�m�q���g�],,2023/11/25,2023/11/25,10:00,12:00,,�_�u���P�A�Ƃ́A�q��ĂƉ��̓����i�s���Ӗ����܂��B�����āA�_�u���P�A�͂�����u�ˑR�v�n�܂�܂��B�q��ĂƉ��𓯎��ɒS�����͔N�X�����X���ɂ���A�����đ��l���ł͂���܂���B�_�u���P�A�ɏ]�����Ă�����A���ꂩ��]�����邩������Ȃ����ɁA�_�u���P�A�Ǝd���̗����̃q���g�ɂ��Ă��b���������܂��B&nbsp;&nbsp;,,,,,,,�I�����C����c�V�X�e���@Zoom,,,,,,,,2023/11/22,,,/tetsuduki/jinken/danjo/kouza/1048973.html,
131199,,�����s,����,�ߘa5�N�x�������N�Z�~�i�[�w�s�D�ǃZ�~�i�[�`�s�D�ǂƂ́A��������ŐV�̎��Ö@�܂Ł`�x,���C��5�l���h�W���Z�C�P���R�E�Z�~�i�[�w�t�j���V���E�Z�~�i�[�`�t�j���V���E�g�n�A�Q���C���J���T�C�V���m�`�����E�z�E�}�f�`�x,,2023/11/30,2023/11/30,18:30,20:30,,���オ�A�s�D�ǂɂ��āA��f�̃^�C�~���O�A�s�D�ǎ��Â�ŐV���Ȃǂɂ��Ă��b���܂��B,,,,,,,����O���[���z�[��601��c��,,,,,,,,,,,/kenko/soudan/josei/1049411.html,
131199,,�����s,����,�ߘa5�N�x�������N�Z�~�i�[�w�����ƒm���Ăق��������ɑ����b��B�����x,���C��5�l���h�W���Z�C�P���R�E�Z�~�i�[�w���b�g�V�b�e�z�V�C�W���Z�C�j�I�I�C�R�E�W���E�Z���V�b�J���x,,2023/11/16,2023/11/16,14:00,16:00,,���オ�A�o�Z�h�E�a�A���{�a�ȂǍb��B�����̏Ǐ�A���ÁA���퐶���̒��ӓ_�Ȃǂɂ��Ă��b���܂��B,,,,,,,����O���[���z�[��601��c��,,,,,,,,,,,/kenko/soudan/josei/1049356.html,
131199,,�����s,����,�ߘa5�N�x���ȍu����,���C��5�l���h�V�J�R�E�G���J�C,,2023/11/19,2023/11/19,14:00,15:00,,�������Ȉ�̌��ꂩ��`����u���ǂ��̎��ُ̈�v,,,,,,,���旧�O���[���z�[���@2�K�z�[���i����h��36-1�j,,,,,,,,2023/11/17,,,/kenko/shokuiku/shien/shika05.html,
131199,,�����s,����,�t���C���`�F�b�N�����,�t���C���`�F�b�N�\�N�e�C�J�C,,2023/12/13,2023/12/13,14:00,16:00,,�t���C���\�h�Ɋւ���u�`�A�ȒP�Ȏ���[�ւ̉񓚁A�葫�̋ؓ��ʁE�ӂ���͂����͒��̑���ȂǁB�����̉^�c�́A�斯�{�����e�B�A�ł���t���C���T�|�[�^�[���s���܂��B,,,,,,,�u���R�~���j�e�B�z�[��,,,,,,,,2023/11/24,,,/kenko/kourei/kourei/1047072.html,
131199,,�����s,����,�t���C���`�F�b�N�����,�t���C���`�F�b�N�\�N�e�C�J�C,,2023/12/18,2023/12/18,14:00,16:00,,�t���C���\�h�Ɋւ���u�`�A�ȒP�Ȏ���[�ւ̉񓚁A�葫�̋ؓ��ʁE�ӂ���͂����͒��̑���ȂǁB�����̉^�c�́A�斯�{�����e�B�A�ł���t���C���T�|�[�^�[���s���܂��B,,,,,,,12��18���i���j���j�d���Ԓ˒n��Z���^�[,,,,,,,,2023/11/24,,,/kenko/kourei/kourei/1047072.html,
131199,,�����s,����,�u10�̋؃g���v�̌��u��,�u10�m�L���g���v�^�C�P���R�E�U,,2023/11/24,2023/11/24,13:30,14:45,,���\�h�Ɍ��ʂ�����ؗ̓g���[�j���O�̐�������ё̌�,,,,,,,���t���z�[�� SOMPO�P�A�����B�[���������i�≺3-5-2�j�s�c�O�c���u�@���v�w���k��8��,,,,,,,,,,,/kenko/kourei/kenshu/1047701.html,
131199,,�����s,����,�t���C���\�h�u����,�t���C�����{�E�R�E�G���J�C,,2023/12/5,2023/12/5,14:00,16:00,,,,,,,,,���旧������ُ��z�[��[������فE�O���[���z�[��],,,,,,,,2023/11/28,,,/kenko/kourei/kenshu/1044195.html,
131199,,�����s,����,�V�j�A�ɂ₳�����X�}�[�g�t�H���̌���,�V�j�A�j���T�V�C�X�}�[�g�t�H���^�C�P���J�C,,2023/7/21,2023/7/21,10:00,17:00,,�X�}�[�g�t�H�������g���łȂ�����A����ɕs����ȕ����A�y���݂Ȃ���X�}�[�g�t�H����e��A�v���̊��p��̌��ł���A�����`���̑̌���ł��B,,,,,,,����n��Z���^�[,,,,,,,,,,,/kenko/kourei/kenshu/1047334.html,
131199,,�����s,����,�V�j�A�ɂ₳�����X�}�[�g�t�H���̌���,�V�j�A�j���T�V�C�X�}�[�g�t�H���^�C�P���J�C,,2023/9/5,2023/9/5,10:00,17:00,,�X�}�[�g�t�H�������g���łȂ�����A����ɕs����ȕ����A�y���݂Ȃ���X�}�[�g�t�H����e��A�v���̊��p��̌��ł���A�����`���̑̌���ł��B,,,,,,,�@���n��Z���^�[,,,,,,,,,,,/kenko/kourei/kenshu/1047334.html,
131199,,�����s,����,�V�j�A�ɂ₳�����X�}�[�g�t�H���̌���,�V�j�A�j���T�V�C�X�}�[�g�t�H���^�C�P���J�C,,2023/9/15,2023/9/15,10:00,17:00,,�X�}�[�g�t�H�������g���łȂ�����A����ɕs����ȕ����A�y���݂Ȃ���X�}�[�g�t�H����e��A�v���̊��p��̌��ł���A�����`���̑̌���ł��B,,,,,,,�O��z�[��,,,,,,,,,,,/kenko/kourei/kenshu/1047334.html,
131199,,�����s,����,�V�j�A�ɂ₳�����X�}�[�g�t�H���̌���,�V�j�A�j���T�V�C�X�}�[�g�t�H���^�C�P���J�C,,2023/9/25,2023/9/25,10:00,17:00,,�X�}�[�g�t�H�������g���łȂ�����A����ɕs����ȕ����A�y���݂Ȃ���X�}�[�g�t�H����e��A�v���̊��p��̌��ł���A�����`���̑̌���ł��B,,,,,,,�����n��Z���^�[,,,,,,,,,,,/kenko/kourei/kenshu/1047334.html,
131199,,�����s,����,�V�j�A�ɂ₳�����X�}�[�g�t�H���̌���,�V�j�A�j���T�V�C�X�}�[�g�t�H���^�C�P���J�C,,2023/11/6,2023/11/6,10:00,17:00,,�X�}�[�g�t�H�������g���łȂ�����A����ɕs����ȕ����A�y���݂Ȃ���X�}�[�g�t�H����e��A�v���̊��p��̌��ł���A�����`���̑̌���ł��B,,,,,,,�x�m���n��Z���^�[,,,,,,,,,,,/kenko/kourei/kenshu/1047334.html,
131199,,�����s,����,�V�j�A�ɂ₳�����X�}�[�g�t�H���̌���,�V�j�A�j���T�V�C�X�}�[�g�t�H���^�C�P���J�C,,2023/11/15,2023/11/15,10:00,17:00,,�X�}�[�g�t�H�������g���łȂ�����A����ɕs����ȕ����A�y���݂Ȃ���X�}�[�g�t�H����e��A�v���̊��p��̌��ł���A�����`���̑̌���ł��B,,,,,,,�M�n�z�[��,,,,,,,,,,,/kenko/kourei/kenshu/1047334.html,
131199,,�����s,����,�V�j�A�ɂ₳�����X�}�[�g�t�H���̌���,�V�j�A�j���T�V�C�X�}�[�g�t�H���^�C�P���J�C,,2023/11/20,2023/11/20,10:00,17:00,,�X�}�[�g�t�H�������g���łȂ�����A����ɕs����ȕ����A�y���݂Ȃ���X�}�[�g�t�H����e��A�v���̊��p��̌��ł���A�����`���̑̌���ł��B,,,,,,,�k��z�[��,,,,,,,,,,,/kenko/kourei/kenshu/1047334.html,
131199,,�����s,����,�ЂƂ�e�ƒ�̃}�l�[�u���i�����炵����炵����ɓ���邽�߂ɍ������ł���ƌv�Ǘ��p�j,�q�g���I���J�e�C�m�}�l�[�R�E�U�i�W�u�����V�C�N���V���e�j�C�����^���j�C�}�X�O�f�L���J�P�C�J�����W���c�j,,2023/11/1,2023/11/1,13:00,15:00,,,,,,,,,�I�����C����c�V�X�e���@Zoom,,,,,,,,2023/10/29,,,/kosodate/hitorioya/1041615.html,
131199,,�����s,����,��39�����㉉�t��,�_�C39�J�C�C�^�o�V�_�C�N�G���\�E�J�C,,2023/12/9,2023/12/9,14:30,16:30,,�I�[�P�X�g���ƍ��؃\���X�g�̏o���E���t�̂��ƁA�斯�ō\����������㍇���c�ɂ�鍇���ŁA�؂₩��1�N����߂�����܂��B,,,,,,,���旧������ّ�z�[��,,,,,,,,2023/12/8,,,/bunka/bunka/event/1049386.html,
131199,,�����s,����,�ߘa5�N�x��1�񌤏C��u���Ə��Ɋւ����@�߁i��b�ҁj�v,���C��5�l���h�_�C1�J�C�P���V���E�J�C�u�W�M���E�V���j�J�J�����J���L���E�z�E���C�i�L�\�w���j�v,,2023/10/16,2023/10/16,14:00,16:00,,�u���Ə��Ɋւ����@�߁i��b�ҁj�v���J�Â��܂��B1�D���Ɋւ���@�K���̊T�v�A2�D��Ȋ��֘A�@�K�̊�b�m���Ɨv�������A3�D�@�߂Ə��̈Ⴂ�A4�D�ᔽ���₷������A�Ȃǂɂ��ĕ�����₷��������܂��B,,,,,,,��ʎВc�@�l���Y�ƘA����i��1-48-11���W�G�r��No.3 2�K�j,,,,,,,,2023/10/11,,,/bousai/kankyo/ondanka/kenshu/1048830.html,
131199,,�����s,����,�ߘa4�N�x��4�񌤏C��u���E�̒E�Y�f����̐��i�Ɛ������l���̕ۑS�̗���ɂ��āv,���C��4�l���h�_�C4�J�C�P���V���E�J�C�u�Z�J�C�m�_�c�^���\�Z�C�T�N�m�X�C�V���g�Z�C�u�c�^���E�Z�C�m�z�[���m�i�K���j�c�C�e�v,,2023/2/24,2023/2/24,15:00,17:00,,���E�ɂ�����E�Y�f����̐��i�ɂ��āA�y��12���ɃJ�i�_�ŊJ�Â��ꂽ�u�������l��COP15�v�ɂāA2030�N�܂ł̍��ۓI�Șg�g�݂����܂�A���ݒ��ڂ���Ă���u�������l���̕ۑS�v�̗���ɂ��ĉ�����܂��B,,,,,,,��ʎВc�@�l���Y�ƘA����i��1-48-11���W�G�r��No.3 2�K�j,,,,,,,,2023/2/21,,,/bousai/kankyo/ondanka/kenshu/1044505.html,
131199,,�����s,����,�ߘa4�N�x��3�񌤏C��u���Ə��̉��w�����Ǘ� -�����@�̗����ƒ��ӓ_-�v,���C��4�l���h�_�C3�J�C�P���V���E�J�C�u�W�M���E�V���m�J�K�N�u�b�V�c�J���� -�R�N�i�C�z�E�m���J�C�g�`���E�C�e��-�v,,2023/2/15,2023/2/15,14:00,16:00,,���w�����Ǘ��ɂ��āA2023�N4����艻�w�����N���̘J�Жh�~�Ɍ����ĘJ�����S�q���K���Ȃǂ̈ꕔ����������܂��B�����ō���́A���Ə��̉��w�����Ǘ��ɂ��Ċ�{�I�Ȗ@���̗����ƒ��ӓ_�𕪂���₷��������܂��B,,,,,,,��ʎВc�@�l���Y�ƘA����i��1-48-11���W�G�r��No.3 2�K�j,,,,,,,,2023/2/10,,,/bousai/kankyo/ondanka/kenshu/1044254.html,
131199,,�����s,����,��46����_�Ƃ܂�i�ߘa5�N�x�j,�_�C46�J�C�C�^�o�V�m�E�M���E�}�c���i���C��5�l���h�j,,2023/11/11,2023/11/11,11:30,16:00,,,,,,,,,�Ԓˑ̈�ْʂ���Ӂ@��1���@�Ԓˑ̈�ْʂ�@��2���@�Ԓˑ̈�فi���ʒ��ԏ�E���N�싅��E�������Z��j�@��3���@�Ԓˏ��w�Z�@��4���@�_�Ƒ̌��_���i�Ԓ�5-22�j,,,,,,,,,,,/bousai/nougyo/event/matsuri/1048574.html,
131199,,�����s,����,��46����_�Ƃ܂�i�ߘa5�N�x�j,�_�C46�J�C�C�^�o�V�m�E�M���E�}�c���i���C��5�l���h�j,,2023/11/12,2023/11/12,10:00,15:30,,,,,,,,,�Ԓˑ̈�ْʂ���Ӂ@��1���@�Ԓˑ̈�ْʂ�@��2���@�Ԓˑ̈�فi���ʒ��ԏ�E���N�싅��E�������Z��j�@��3���@�Ԓˏ��w�Z�@��4���@�_�Ƒ̌��_���i�Ԓ�5-22�j,,,,,,,,,,,/bousai/nougyo/event/matsuri/1048574.html,
131199,,�����s,����,�a��h����J�u���i����j,�V�u�T���G�C�C�`�R�E�J�C�R�E�U�i�_�C�j�J�C�j,,2023/11/24,2023/11/24,14:00,16:00,,��ꕔ�u�g���a���Ёh�a��h�� �����̐l�Ԋw�i�W�F�����g���W�[�j�v�@�u�t�@�i�n�Ɓj�����s���N������ÃZ���^�[ �V�N�w���Z���^�[�i���@�{�{ �F��@��&nbsp;��񕔁uTV�h���}�̗��j�I�����ɂ��āB�h�V���Ղ��h�A�h���܂�h���ςāB�v�@�u�t�@�i�n�Ɓj�����s���N������ÃZ���^�[�ږ��@� �F�v�@��,,,,,,,�旧������ّ��c��,,,,,,,,2023/11/6,,,/bunka/kanko/1049228.html,
131199,,�����s,����,�ό��A�v���uITA-�}�j�A�v�t�H�g����R���e�X�g�u�ԉ΁v��܍�i�̔��\,�J���R�E�A�v���uITA-�}�j�A�v�t�H�g�Z�������E�R���e�X�g�u�n�i�r�v�W���V���E�T�N�q���m�n�b�s���E,,2023/8/5,2023/8/9,,,,,,,,,,,,,,,,,,,,,,/bunka/kanko/map/1049048.html,
131199,,�����s,����,�ό��A�v���uITA-�}�j�A�v�f�W�^���X�^���v�����[�J�Âɂ���,�J���R�E�A�v���uITA-�}�j�A�v�f�W�^���X�^���v�����[�J�C�T�C�j�c�C�e,,2023/11/8,2024/1/10,,,,"	�{�y�[�W�����ɂ���񎟌��R�[�h����A�ό��A�v���uITA-�}�j�A�v���_�E�����[�h���Ă��������B	�J�Ê��Ԓ��ɃX�^���v�ݒu�{�݁i���20�{�݁j���܂��A�f�W�^���X�^���v���W�߂Ă��������B�i�f�W�^���X�^���v�́A�e�{�݂ɐݒu���Ă���񎟌��R�[�h���A�v�����N�����ēǂݍ��ނ��ƂŏW�߂邱�Ƃ��o���܂��B�j	�f�W�^���X�^���v����萔�W�߂�ƁA���I�őf�G�ȏܕi��������܂��B�i�X�^���v2��1���ډ���A�X�^���v4��2���ډ���A�X�^���v6��3���ډ���\�ł��B�ő�3������\�B�ܕi�͂��I�тł��܂���̂ŗ\�߂��������������B�j	�R���v���[�g�܂Ƃ��āA���ׂĂ̎{�݁i20�{�݁j�̃X�^���v���W�߂����撅300���l�ɑf�G�ȃv���[���g��p�ӂ��Ă��܂��B�R���v���[�g�܂́A�����΂��ό��Z���^�[�ł��n�����܂��B	�Ԓ˃G���A�B���܂Ƃ��āA�Ԓ˃G���A5�{�݁i���p�فA�ԒːA�����A���y�����فA���y�|�\�`���فA�����J�ƏZ��j�̃X�^���v�����ׂďW�߂��Q���҂̂����A�ܕi�����ꏊ�ւ̐撅500���l�ɑf�G�ȃv���[���g�����p�ӂ��Ă��܂��B�Ԓ˃G���A�B���܂́A���y�����قł��n�����܂��B",,,,,,,�X�^���v�ݒu�{�݁i��������{�ݓ�20�{�݁j�A���L�O����X�|�[�c�Z���^�[�i�������̈�فj�i����1-10-5�j�A���`���فi����1-10-5�j�����΂��ό��Z���^�[�i��3-14-15�j�����ǂ��������i��3-50-1�@�����������j�ܕēX�i���h40-1�j������̈�فi������3-1-1�j�G�R�|���X�Z���^�[�i�O�쒬4-6-1�j����̈�فi����1-3-1�j�����}���فi��Ց�4-3-1�j����Ȋw�فi��Ց�4-14-1�j���p�فi�Ԓ�5-34-27�j�Ԓˑ̈�فi�Ԓ�5-6-1�j�ԒːA�����i�Ԓ�5-17-14�j���y�����فi�Ԓ�5-35-25�j�����������v�[���i������8-28-1�j�M�ъ��A���فi������8-29-2�j���ǂ��������E�����������i������8-24-1���ۃP���������j���T�C�N���v���U�i�M�n4-16-6�j���y�|�\�`���فi����6-29-13�j�����J�ƏZ��i����7-11-1�j�E�ꏊ�̏ڍׂ��ẮA�ǂ��i�r�����΂��i�O�������N�j�ł��m�F���������B,,,,,,,,,,,/bunka/kanko/map/1026826.html,
131199,,�����s,����,�ߘa5�N�x�@���a�G��E�����W�i��������j,���C��5�l���h�@�w�C���J�C�K�E�Q���o�N�e���i�C�^�o�V�N���N�V���j,,2023/8/15,2023/8/21,9:00,17:00,,������E���w�����u���a�Ɛ푈�v���e�[�}�ɕ`�����G��E�|�X�^�[�̗D�G��i�W�����s���܂��B�y���̑��W�����e�z�E�旧���y�����ُ��� �����Њ֘A�p�l���W���E���{��j�錾�����̋��c��� �����֘A�p�l���E�|�X�^�[�W���E�L�����a�L�O�����ْ� �u�q���V�}��m�낤�I8��6���A���̂��_�̉��Łv�EUNHCR�����������E���{�ԏ\���Г����s�x���� �E�N���C�i�l���x���֘A�p�l���W���E�斯�C�x���g�X�N�G�A�ɂċ����Ў���DVD�u����̋�P�`���p�����̓��̂��Ɓ`�v����f�B&nbsp;&nbsp;,,,,,,,��������k��1�K�@�斯�C�x���g�X�N�G�A[���a�G��E�����W�@���a�W],,,,,,,,,,,/kusei/seisakukeiei/sengen/1047563.html,
131199,,�����s,����,�ߘa5�N�x�@���a�G��E�����W�i�Ԓˎx���j,���C��5�l���h�@�w�C���J�C�K�E�Q���o�N�e���i�A�J�c�J�V�V���j,,2023/8/23,2023/8/31,9:00,21:00,,������E���w�����u���a�Ɛ푈�v���e�[�}�ɕ`�����G��E�|�X�^�[�̗D�G��i�W�����s���܂��y���̑��W�����e�z�E�旧���y�����ُ��� �����Њ֘A�p�l���W���E���{��j�錾�����̋��c��� �����֘A�p�l���E�|�X�^�[�W���E�L�����a�L�O�����ْ� �u�q���V�}��m�낤�I8��6���A���̂��_�̉��Łv�EUNHCR�����������E���{�ԏ\���Г����s�x���� �E�N���C�i�l���x���֘A�p�l���W��&nbsp;&nbsp;&nbsp;,,,,,,,�Ԓˎx��1�K�@�M�������[[���a�G��E�����W�@���a�W],,,,,,,,,,,/kusei/seisakukeiei/sengen/1047564.html,
131199,,�����s,����,i-youth�i�����E��[���j music concert,i-youth�i�A�C�E���[�X�j music concert,,2023/11/25,2023/11/25,13:30,15:30,,�[�Q���҂Ɖ��t�Ƃ��ꏏ�ɂ��肠����R���T�[�g�[������������������������Ȃ��I�D���ȋȂ𐶉��t�ŉ̂�����A�D���Ȋy�� �ŉ��t�Ɓi���@�C�I�����A���B�I���A�`�F���A�s�A�m�j�ƈꏏ�ɃZ�b�V�������܂��񂩁H����ɃR���T�[�g�㔼�ɂ͉��t�Ƃɂ��s�A�m�E���y��R���T�[�g���B�ɏ�̉��y�̌������Б̊����ɗ��Ă��������I,,,,,,,�匴���U�w�K�Z���^�[�i�܂Ȃہ[�Ƒ匴�j3�K ���N���G�[�V�����z�[���i�܂Ȃہ[�ƃz�[���j���ݒn�@�匴��5�[18[�܂Ȃہ[�Ƒ匴�̂��ē�],,,,,,,,,,,/kyoikuiinkai/shogai/manaport/ohara/1049051.html,
131199,,�����s,����,�y�����}���فz�̂��ėV�ڂ��@���׉́I�i�T���{���T�����}���قƂ̎o���}���٘A�g���Ɓj 2023�N12��17��,�y�`���E�I�E�g�V���J���z�E�^�b�e�A�\�{�E�@�����x�E�^�I�i�T���{���T�W�h�E�g�V���J���g�m�V�}�C�g�V���J�������P�C�W�M���E�j 2023�l��12�K�c17�j�`,,2023/12/17,2023/12/17,10:00,11:30,,,,,,,,,�����}���ف@1F�}���كz�[��,,,,,,,,,,,/kosodate/1000930/etc/1049416.html,
131199,,�����s,����,�y�u���}���فz3D�v�����^�[�ɂ��傤����@2023�N10��15��,�y�V�����g�V���J���z3D�v�����^�[�j�`���E�Z���@2023�l��10�K�c15�j�`,,2023/10/15,2023/10/15,14:00,16:00,,3D�v�����^�[�������̂Ɠ������`�[�t��S�y�ōH��,,,,,,,�u���R�~���j�e�B�z�[���@2�K��1�a��,,,,,,,,,,,/kosodate/1000930/etc/1047753.html,
131199,,�����s,����,�����Ђ��u�ۈ牀�@�e�̕ۈ�m�̌�,�A�T�q�K�I�J�z�C�N�G���@�I���m�z�C�N�V�^�C�P��,,2023/7/3,2024/3/24,9:00,12:00,,�ی�҂ɂ��ۈ�m�̌����s���Ă��܂��B���q�l�̉��ł̗l�q�����Ă݂܂��񂩁H���҂����Ă���܂��B,,,,,,,�����Ђ��u�ۈ牀,,,,,,,,,,,/kosodate/azukeru/ninka/annai/hoikuen/asahigaoka/1015546/1047066.html,
131199,,�����s,����,����������ݕۈ牀�@�ۈ牀���w�c�A�[,�^�J�V�}�_�C���N���~�z�C�N�G���@�z�C�N�G���P���K�N�c�A�[,,2023/10/3,2023/10/3,10:00,10:30,,�ۈ牀�̏Љ��ۈ牀�Œ񋟂���Ă��闣���H�̏Љ���s���܂��B���5�g�܂łƂ����Ē����܂��B���O�ɓd�b�ɂė\��̘A�������肢�������܂��B&nbsp;,,,,,,,����������ݕۈ牀,,,,,,,,,,,/kosodate/azukeru/ninka/annai/hoikuen/kurumi/1015570/1048671.html,
131199,,�����s,����,����������ݕۈ牀�@�ۈ牀���w�c�A�[,�^�J�V�}�_�C���N���~�z�C�N�G���@�z�C�N�G���P���K�N�c�A�[,,2023/10/4,2023/10/4,10:00,10:30,,�ۈ牀�̏Љ��ۈ牀�Œ񋟂���Ă��闣���H�̏Љ���s���܂��B���5�g�܂łƂ����Ē����܂��B���O�ɓd�b�ɂė\��̘A�������肢�������܂��B&nbsp;,,,,,,,����������ݕۈ牀,,,,,,,,,,,/kosodate/azukeru/ninka/annai/hoikuen/kurumi/1015570/1048671.html,
131199,,�����s,����,����������ݕۈ牀�@�ۈ牀���w�c�A�[,�^�J�V�}�_�C���N���~�z�C�N�G���@�z�C�N�G���P���K�N�c�A�[,,2023/10/5,2023/10/5,10:00,10:30,,�ۈ牀�̏Љ��ۈ牀�Œ񋟂���Ă��闣���H�̏Љ���s���܂��B���5�g�܂łƂ����Ē����܂��B���O�ɓd�b�ɂė\��̘A�������肢�������܂��B&nbsp;,,,,,,,����������ݕۈ牀,,,,,,,,,,,/kosodate/azukeru/ninka/annai/hoikuen/kurumi/1015570/1048671.html,